program: Gaussian 09
title: 000066240
version: EM64L-G09RevD.01
frameworkgroup: C1[X(C11H10S)]
method: RPBEPBE
basis: SDD
operation: Freq
keyword: #pfreq=noraman
keyword: PBEPBE/SDD
title: #p freq=noraman PBEPBE/SDD
converged: YES YES NO NO
title: Mulliken charges:
elementType: S C C C C C C C C C C C H H H H H H H H H H
charge: 0.171328 0.409901 0.390156 -0.381785 -0.434177 -0.397336 -0.413930 -0.251829 -0.235336 -0.250210 -0.242700 -0.846878 0.239779 0.263136 0.237945 0.257833 0.231141 0.228696 0.229450 0.253773 0.272785 0.268258
chargesum: 0.00000
title: Mulliken charges with hydrogens summed into heavy atoms:
elementType: S C C C C C C C C C C C
charge: 0.171328 0.409901 0.390156 -0.381785 -0.194398 -0.134199 -0.175985 0.006004 -0.004195 -0.021514 -0.013249 -0.052063
polarizability: 1.71400705e+02 7.00757422e+00 1.62520599e+02 -3.72448488e+00 1.50580362e+00 6.88663922e+01
1716.lowfreq: -10.7304 -0.0032 -0.0028 -0.0019 4.9829 12.0302 64.9418 91.0372 136.4859
frequency: 64.7984 91.0335 136.4776 159.7093 179.9818 214.2643 266.2894 368.3347 415.5601 420.2395 473.2331 509.2262 525.4429 553.7690 634.7653 643.3460 655.3803 747.7150 785.2165 789.8964 806.7246 816.9118 885.9876 925.9686 949.6502 965.1938 969.4017 987.4090 988.5248 998.2954 1024.4208 1060.4922 1132.6685 1158.8005 1170.1368 1200.6075 1234.4280 1259.9525 1339.5996 1355.1829 1397.1628 1409.0958 1431.1623 1443.7601 1446.1853 1463.4792 1505.7637 1572.8672 1593.1641 1630.4949 3010.0362 3121.3759 3124.8462 3130.4944 3132.6690 3135.2060 3144.6789 3145.6809 3162.2917 3164.3862
redmass: 3.3327 3.5517 1.0631 3.5581 3.9474 6.5795 3.9169 8.6356 4.3591 3.2701 3.2387 7.1496 7.1872 3.2998 4.0678 5.0597 6.6974 1.2715 5.1750 1.9122 5.0993 1.6151 1.6191 1.4188 5.9669 1.2812 1.2498 1.3723 1.2981 1.3320 2.3640 2.1590 1.7506 1.2632 1.1001 1.5289 1.9059 1.6380 1.1418 2.0457 3.1019 4.6920 2.7677 1.1594 2.0196 1.0557 3.6750 7.6894 5.5813 6.7273 1.0279 1.0862 1.0869 1.0885 1.1048 1.1044 1.0932 1.0937 1.1004 1.0985
irintensity: 1.7901 0.6520 0.0232 1.1717 2.1379 1.1288 3.5358 0.2628 2.1029 8.2424 0.2630 0.2274 0.5077 5.4507 1.1831 0.5685 5.9111 1.3134 1.6016 77.1081 4.1856 67.5716 1.7702 0.0348 10.4463 4.4403 2.2362 2.8534 18.6455 3.9178 8.8593 4.7154 1.4103 0.2443 3.0723 2.4029 4.8700 8.8510 1.0293 15.9140 6.4480 0.0035 1.9123 15.2361 0.8455 10.2327 12.8133 5.3276 3.8455 0.1889 31.5086 1.1052 2.7874 4.6030 15.1240 12.7496 1.2351 36.7780 44.1839 10.5005
temp: 298.150 k
press: 1.00000 atm
elementType: 16 6 6 6 6 6 6 6 6 6 6 6 1 1 1 1 1 1 1 1 1 1
symmnumber: 1
zpe: 454759.4 jmol-1
zpe.correction: 0.173209 hartree
zpe.thermalcorrener: 0.183677 hartree
zpe.thermalcorrenthalpy: 0.184621 hartree
zpe.thermalcorrgfe: 0.136738 hartree
zpe.sumelectzpe: -822.397294 hartree
zpe.sumelectthermal: -822.386825 hartree
zpe.sumelectthermalent: -822.385881 hartree
zpe.sumelectthermalfe: -822.433765 hartree
dipole: -0.9755 0.0561 1.6303
dipole: 1.9007
quadrupole: -71.1826 -67.7523 -82.6327
quadrupole: -0.8301 3.0862 -0.3077
quadrupole: 2.6733 6.1036 -8.7769 -0.8301 3.0862 -0.3077
hfenergy: -822.5705023 hartree
pointgroup: C01 [X(C11H10S1)]
dipole: 0.3411365 0.1168724 -0.6550993 debye
dipolederiv: -0.1092429 0.0297516 -0.0810534 -0.0190635 -0.1714364 -0.0394574 -0.0965217 -0.0408008 0.0213188 -0.0999982 -0.1233839 0.0323066 -0.2817698 -0.1180095 0.0177748 0.087179 0.0492023 0.0278387 -0.015721 -0.1289603 0.0191687 -0.0465019 -0.0260563 0.0182842 -0.0023266 0.030633 0.0540589 0.3427446 0.2035032 -0.0096013 0.3179609 0.2124096 -0.0396106 0.0186564 0.0135657 -0.1928016 0.0241661 0.0756859 -0.0518661 0.0119972 0.0543319 -0.0397429 -0.0312251 -0.0319175 -0.1606138 -0.0663667 0.0884536 -0.0334713 0.0422915 0.0006501 -0.0126504 -0.0386134 -0.0459729 -0.1334433 0.0368899 0.0520645 -0.0425307 0.0927645 0.0175107 -0.0335209 -0.0409141 -0.0274997 -0.1645233 -0.0468433 -0.0765755 -0.0343714 -0.0295094 -0.1617555 -0.011239 -0.0387306 -0.0136503 -0.112546 -0.0971862 -0.0015056 -0.0164233 -0.0186965 0.1236366 -0.017531 -0.0238852 -0.0335706 -0.1461359 -0.0736955 -0.0224078 -0.0103251 0.0001675 0.1523593 -0.041485 -0.0031554 -0.0379198 -0.1541039 0.1233861 0.0158309 -0.0522899 -0.0016238 -0.0886191 -0.0081204 -0.0463869 -0.0050882 -0.1505823 -0.0448355 -0.0419974 0.0883739 -0.0304799 0.0455641 0.0904075 0.106947 0.0654439 0.1126403 -0.0136528 -0.1270975 0.037614 -0.0583885 -0.015489 0.0246322 0.0378603 0.0374114 0.1454872 0.0666721 -0.1005454 0.0315932 -0.0569149 0.0112428 0.0108103 0.0173121 0.0248756 0.1313196 -0.0091589 -0.0606493 0.0308597 -0.1232445 -0.0293473 0.0377678 0.0401266 0.0266568 0.1467224 -0.0617124 0.0471671 0.0250701 0.0315673 0.0995815 0.0087329 0.0271245 0.005776 0.142102 0.0589608 0.0605134 0.0096078 0.0456895 -0.1250338 0.0104447 0.0147597 0.0176615 0.1582402 0.0582724 0.0626175 0.0055797 0.0784674 -0.1075802 0.0239827 0.0043626 0.0232947 0.1533365 -0.1292739 0.0518852 0.038999 0.0555503 0.0798067 0.0000932 0.0407856 -0.0017773 0.1546317 -0.0009287 -0.1322909 -0.0099866 -0.1496376 -0.0238505 -0.018505 -0.0388513 -0.0333633 0.0721686 -0.0282951 0.0984571 0.0702281 0.0654357 0.0741889 -0.0530433 0.0504 -0.0415969 -0.0198224 0.0858192 0.0294838 -0.0474817 0.0739386 -0.0041047 0.0719757 -0.0849033 0.0186362 -0.0852923 unknown
polarizability: 173.323415|-4.5167894|160.1153304|-8.2501235|0.2042173|69.348951 unknown
InChI: InChI=1S/C11H10S/c1-12-11-8-4-6-9-5-2-3-7-10(9)11/h2-8H,1H3
charge 0 multiplicity 1
22 atoms
S  -2.659813 -1.116114 0.671913
C  0.023071 -0.207209 0.166675
C  0.989009 0.845757 -0.098239
C  -1.361976 0.162218 0.334986
C  0.550739 2.209991 -0.154538
C  0.489992 -1.560722 0.251879
C  2.367525 0.496153 -0.288491
C  -1.753601 1.503189 0.281212
C  -0.791759 2.534809 0.041064
C  1.839784 -1.867553 0.064725
C  2.787769 -0.832824 -0.214963
C  -2.869233 -1.815051 -1.076825
H  1.289992 2.995762 -0.350792
H  -0.234777 -2.345755 0.494877
H  3.090111 1.296255 -0.489705
H  -2.808884 1.758818 0.419173
H  -1.122607 3.578183 0.003668
H  2.180392 -2.906119 0.139957
H  3.843018 -1.087885 -0.361347
H  -3.606896 -2.629124 -0.997035
H  -1.909672 -2.210102 -1.443922
H  -3.242985 -1.029277 -1.750072
