program: Orca
programVersion: 5.0.2
elementType: Br Cl S P O O O C C C C C C C C C C C H H H H H H H H H H H H H H H
charge: 0
multiplicity: 1
keywords: wb97x-d3
keywords: def2-TZVPP
keywords: def2/J RIJCOSX
keywords: DEFGRID2
keywords: scfconv7
keywords: smallprint printgap noloewdin
keywords: NOSOSCF
formula: C11H15BrClO3PS
InChI: InChI=1/C11H15BrClO3PS/c1-3-7-18-17(14,15-4-2)16-11-6-5-9(12)8-10(11)13/h5-6,8H,3-4,7H2,1-2H3
33 atoms
Br 4.492279 1.989041 -0.268436
Cl -0.252688 1.353264 2.448735
S  -3.070394 -2.192065 1.124949
P  -1.740842 -1.216309 -0.12154
O  -0.501438 -1.13286 0.928882
O  -2.193912 0.311742 -0.216329
O  -1.454539 -1.864438 -1.416484
C  -3.873739 -3.337901 -0.05882
C  -5.209182 -2.83538 -0.579692
C  -5.112297 -1.566963 -1.410418
C  0.611792 -0.410964 0.611227
C  -2.309525 1.004583 -1.469488
C  0.865045 0.780811 1.280088
C  1.510103 -0.867758 -0.3403
C  -0.976595 1.521607 -1.958195
C  2.020384 1.500822 1.018182
C  2.664301 -0.153514 -0.614577
C  2.913386 1.025136 0.071404
H  -4.001698 -4.261626 0.505841
H  -3.174395 -3.543917 -0.868328
H  -5.64021 -3.639523 -1.18361
H  -5.893875 -2.681263 0.257322
H  -4.79664 -0.72022 -0.800004
H  -4.399198 -1.682963 -2.228235
H  -6.079088 -1.311643 -1.843227
H  -2.771196 0.35714 -2.217505
H  -2.996371 1.826938 -1.27074
H  1.30618 -1.793796 -0.86042
H  -0.492507 2.148849 -1.209533
H  -0.301872 0.707163 -2.220118
H  -1.128752 2.12543 -2.85376
H  2.207805 2.421436 1.552757
H  3.359764 -0.521551 -1.355678
totalener: -4428.04392417 hartree
nucrepener: 2259.33601755 hartree
electener: -6687.37994172 hartree
twoeener: 3943.04543182 hartree
kineticenergy: 4419.46913216 hartree
xcener: -190.175172781993 hartree
chargesum: 0.0000000
charge: -0.016540 -0.042210 -0.146387 0.791426 -0.333023 -0.324643 -0.523445 -0.124910 -0.084928 -0.277534 0.206489 0.025686 -0.021016 -0.167024 -0.259445 -0.075458 -0.069009 -0.062292 0.116371 0.119602 0.068096 0.066013 0.079886 0.087781 0.094342 0.097094 0.101959 0.139855 0.089397 0.096644 0.095999 0.120047 0.131173
qa: -0.0165 -0.0422 -0.1464 0.7914 -0.3330 -0.3246 -0.5234 -0.1249 -0.0849 -0.2775 0.2065 0.0257 -0.0210 -0.1670 -0.2594 -0.0755 -0.0690 -0.0623 0.1164 0.1196 0.0681 0.0660 0.0799 0.0878 0.0943 0.0971 0.1020 0.1399 0.0894 0.0966 0.0960 0.1200 0.1312
va: 1.2340 1.2690 2.2957 5.4840 2.1573 2.0857 2.0675 3.8820 3.8752 3.9332 3.8639 3.8703 4.0063 3.9882 3.9440 3.9090 3.8795 4.0492 1.0061 1.0338 1.0099 1.0112 1.0102 1.0054 1.0118 0.9942 0.9888 1.0158 1.0025 1.0088 1.0142 1.0153 1.0002
dispcorr: -0.019080591 hartree
energy: -4428.063004760514
dipole: -72.53066 71.80247 -0.72819 -29.12607 29.14495 0.01888 -16.49193 15.90196 -0.58997
magnitude: 0.93738 au
magnitude: 2.38264 debye
