program: Orca
programVersion: 5.0.2
elementType: Br Cl S P O O O C C C C C C C C C C C H H H H H H H H H H H H H H H
charge: 0
multiplicity: 1
keywords: wb97x-d3
keywords: def2-TZVPP
keywords: def2/J RIJCOSX
keywords: DEFGRID2
keywords: scfconv7
keywords: smallprint printgap noloewdin
keywords: NOSOSCF
formula: C11H15BrClO3PS
InChI: InChI=1/C11H15BrClO3PS/c1-3-7-18-17(14,15-4-2)16-11-6-5-9(12)8-10(11)13/h5-6,8H,3-4,7H2,1-2H3
33 atoms
Br 4.708671 1.916738 0.530521
Cl 1.155166 -2.109469 -0.673401
S  -3.386889 -1.556282 0.763989
P  -1.919861 -0.193264 0.28934
O  -0.659652 -0.712417 1.181043
O  -2.366833 1.0912 1.129476
O  -1.622281 0.011922 -1.137682
C  -2.994859 -2.873645 -0.451397
C  -3.618283 -2.644676 -1.816468
C  -3.30142 -3.79397 -2.764311
C  0.552246 -0.1030 1.022089
C  -3.082293 2.158693 0.485024
C  1.506177 -0.660177 0.178642
C  0.853364 1.052138 1.724993
C  -2.133336 3.197524 -0.065036
C  2.749854 -0.065693 0.034481
C  2.091355 1.656493 1.589136
C  3.029471 1.09572 0.736613
H  -3.378956 -3.785463 0.009284
H  -1.91195 -2.985304 -0.515883
H  -4.699505 -2.536763 -1.706396
H  -3.245477 -1.70748 -2.229351
H  -2.226256 -3.897302 -2.916762
H  -3.676283 -4.745883 -2.38458
H  -3.755216 -3.628605 -3.741086
H  -3.728518 1.767098 -0.304571
H  -3.72654 2.580564 1.255847
H  0.112044 1.472508 2.390449
H  -2.702155 4.030496 -0.479489
H  -1.484176 3.592637 0.716064
H  -1.513635 2.78378 -0.858804
H  3.480108 -0.509756 -0.627127
H  2.314186 2.556686 2.144148
totalener: -4428.04556223 hartree
nucrepener: 2234.35778706 hartree
electener: -6662.40334929 hartree
twoeener: 3918.17450236 hartree
kineticenergy: 4419.46637441 hartree
xcener: -190.170253736816 hartree
chargesum: -0.0000000
charge: -0.018238 -0.056394 -0.145730 0.762900 -0.332747 -0.351023 -0.501546 -0.092943 -0.096814 -0.253126 0.230785 0.028569 0.032411 -0.185378 -0.246048 -0.074482 -0.072804 -0.069913 0.113473 0.100436 0.057851 0.083327 0.081993 0.071982 0.088583 0.089639 0.096131 0.138420 0.090029 0.077090 0.104013 0.121020 0.128536
qa: -0.0182 -0.0564 -0.1457 0.7629 -0.3327 -0.3510 -0.5015 -0.0929 -0.0968 -0.2531 0.2308 0.0286 0.0324 -0.1854 -0.2460 -0.0745 -0.0728 -0.0699 0.1135 0.1004 0.0579 0.0833 0.0820 0.0720 0.0886 0.0896 0.0961 0.1384 0.0900 0.0771 0.1040 0.1210 0.1285
va: 1.2332 1.2533 2.3076 5.5313 2.1177 2.1061 2.0828 3.8864 3.8889 3.9547 3.8732 3.8984 4.0198 4.0147 3.9109 3.9250 3.8845 4.0617 1.0078 1.0292 1.0136 1.0293 1.0035 1.0025 1.0063 1.0028 0.9918 1.0109 1.0123 1.0047 1.0180 1.0120 1.0010
dispcorr: -0.017071154 hartree
energy: -4428.062633381100
dipole: -72.43784 71.66386 -0.77398 -19.52671 19.83011 0.30340 -13.43944 13.72055 0.28112
magnitude: 0.87757 au
magnitude: 2.23060 debye
