program: Orca
programVersion: 5.0.2
elementType: Br Cl S P O O O C C C C C C C C C C C H H H H H H H H H H H H H H H
charge: 0
multiplicity: 1
keywords: wb97x-d3
keywords: def2-TZVPP
keywords: def2/J RIJCOSX
keywords: DEFGRID2
keywords: scfconv7
keywords: smallprint printgap noloewdin
keywords: NOSOSCF
formula: C11H15BrClO3PS
InChI: InChI=1/C11H15BrClO3PS/c1-3-7-18-17(14,15-4-2)16-11-6-5-9(12)8-10(11)13/h5-6,8H,3-4,7H2,1-2H3
33 atoms
Br 4.54481 0.05502 1.041522
Cl 0.497564 -0.353059 -2.662559
S  -1.792327 -1.416371 0.057456
P  -2.356721 0.532403 -0.375846
O  -1.019382 1.333011 -0.826095
O  -2.556586 1.155862 1.083205
O  -3.447027 0.69298 -1.3463
C  -2.32849 -2.300127 -1.459334
C  -3.510237 -3.218521 -1.19493
C  -4.783144 -2.493154 -0.79064
C  0.227712 1.035207 -0.372991
C  -3.735071 0.831219 1.836841
C  1.067723 0.254871 -1.160153
C  0.68817 1.52366 0.838155
C  -3.966312 1.919114 2.856809
C  2.356595 -0.033702 -0.746246
C  1.975489 1.241663 1.265191
C  2.799413 0.459648 0.470751
H  -1.457381 -2.861331 -1.79477
H  -2.566342 -1.565709 -2.227348
H  -3.684309 -3.783248 -2.11581
H  -3.239773 -3.956442 -0.435661
H  -5.611113 -3.194587 -0.692051
H  -4.662997 -1.989206 0.16827
H  -5.062282 -1.738151 -1.524953
H  -4.594483 0.746409 1.167398
H  -3.588874 -0.137748 2.320263
H  0.034424 2.134723 1.445291
H  -4.846313 1.678601 3.453154
H  -3.119329 2.017403 3.535058
H  -4.139087 2.88068 2.37531
H  2.995294 -0.642754 -1.370072
H  2.324071 1.629542 2.211869
totalener: -4428.04448922 hartree
nucrepener: 2259.84443455 hartree
electener: -6687.88892377 hartree
twoeener: 3943.37463716 hartree
kineticenergy: 4419.46868559 hartree
xcener: -190.175463218340 hartree
chargesum: -0.0000000
charge: -0.017829 -0.050517 -0.183985 0.779239 -0.326241 -0.328206 -0.497073 -0.102904 -0.096785 -0.244226 0.151512 0.018614 0.037281 -0.103928 -0.235206 -0.080682 -0.094759 -0.053897 0.114014 0.109945 0.069772 0.063178 0.089775 0.059032 0.097084 0.102881 0.088591 0.134896 0.079480 0.082396 0.090558 0.119902 0.128090
qa: -0.0178 -0.0505 -0.1840 0.7792 -0.3262 -0.3282 -0.4971 -0.1029 -0.0968 -0.2442 0.1515 0.0186 0.0373 -0.1039 -0.2352 -0.0807 -0.0948 -0.0539 0.1140 0.1099 0.0698 0.0632 0.0898 0.0590 0.0971 0.1029 0.0886 0.1349 0.0795 0.0824 0.0906 0.1199 0.1281
va: 1.2332 1.2659 2.2642 5.5399 2.1568 2.1187 2.1299 3.8860 3.9254 3.9402 3.8993 3.8794 3.9686 3.9983 3.9781 3.9537 3.9205 4.0505 1.0095 1.0312 1.0091 1.0114 1.0084 1.0103 1.0074 0.9919 0.9923 1.0121 1.0087 1.0035 1.0067 1.0149 1.0014
dispcorr: -0.017676673 hartree
energy: -4428.062165888965
dipole: -79.38534 79.14713 -0.23822 -8.63359 8.08323 -0.55036 0.42569 0.63609 1.06178
magnitude: 1.21943 au
magnitude: 3.09954 debye
