program: Orca
programVersion: 5.0.2
elementType: Br Cl S P O O O C C C C C C C C C C C H H H H H H H H H H H H H H H
charge: 0
multiplicity: 1
keywords: wb97x-d3
keywords: def2-TZVPP
keywords: def2/J RIJCOSX
keywords: DEFGRID2
keywords: scfconv7
keywords: smallprint printgap noloewdin
keywords: NOSOSCF
formula: C11H15BrClO3PS
InChI: InChI=1/C11H15BrClO3PS/c1-3-7-18-17(14,15-4-2)16-11-6-5-9(12)8-10(11)13/h5-6,8H,3-4,7H2,1-2H3
33 atoms
Br 4.554313 1.072046 -0.370536
Cl -0.197638 1.379684 2.395344
S  -3.942542 -1.197371 0.414374
P  -2.280825 -0.34332 -0.451516
O  -1.094911 -0.750138 0.598269
O  -2.491911 1.206496 -0.157962
O  -1.996874 -0.729104 -1.846668
C  -3.878006 -2.833326 -0.407228
C  -2.821681 -3.77046 0.151907
C  -2.874557 -5.131636 -0.528049
C  0.181098 -0.331916 0.351324
C  -2.389971 2.196043 -1.196626
C  0.739073 0.661728 1.148133
C  0.93652 -0.896013 -0.665471
C  -0.955087 2.602664 -1.439748
C  2.045438 1.079412 0.94226
C  2.23964 -0.483565 -0.884242
C  2.784276 0.50495 -0.079304
H  -3.751041 -2.673618 -1.477576
H  -4.878467 -3.24211 -0.254149
H  -1.830675 -3.335247 0.015736
H  -2.963756 -3.877115 1.228818
H  -3.846059 -5.610026 -0.394681
H  -2.691483 -5.047443 -1.600009
H  -2.120052 -5.80189 -0.117652
H  -2.850434 1.827468 -2.114879
H  -2.979102 3.039584 -0.839568
H  0.499508 -1.664098 -1.287604
H  -0.480323 2.947682 -0.521874
H  -0.368743 1.779836 -1.848642
H  -0.925235 3.419969 -2.161222
H  2.46535 1.849652 1.573716
H  2.818113 -0.930801 -1.680068
totalener: -4428.04489085 hartree
nucrepener: 2256.75582131 hartree
electener: -6684.80071215 hartree
twoeener: 3940.45779172 hartree
kineticenergy: 4419.46828096 hartree
xcener: -190.172702634145 hartree
chargesum: -0.0000000
charge: -0.017697 -0.043690 -0.137605 0.771751 -0.329378 -0.338615 -0.519924 -0.114891 -0.087598 -0.251989 0.237681 0.033431 -0.050953 -0.138070 -0.259239 -0.055754 -0.077845 -0.071324 0.118985 0.111976 0.058977 0.066513 0.074821 0.082716 0.089414 0.093990 0.096091 0.126804 0.086980 0.097406 0.096389 0.119945 0.130703
qa: -0.0177 -0.0437 -0.1376 0.7718 -0.3294 -0.3386 -0.5199 -0.1149 -0.0876 -0.2520 0.2377 0.0334 -0.0510 -0.1381 -0.2592 -0.0558 -0.0778 -0.0713 0.1190 0.1120 0.0590 0.0665 0.0748 0.0827 0.0894 0.0940 0.0961 0.1268 0.0870 0.0974 0.0964 0.1199 0.1307
va: 1.2337 1.2671 2.3146 5.5044 2.0898 2.1276 2.0710 3.8967 3.8905 3.9501 3.8190 3.8897 4.0402 4.0113 3.9130 3.8965 3.8990 4.0503 1.0262 1.0044 1.0230 1.0170 1.0041 1.0027 1.0056 1.0038 0.9904 1.0204 1.0069 1.0072 1.0147 1.0151 1.0015
dispcorr: -0.018355108 hartree
energy: -4428.063245953744
dipole: -62.36609 62.06234 -0.30375 -27.62540 27.43195 -0.19345 -10.09993 9.83279 -0.26714
magnitude: 0.44839 au
magnitude: 1.13971 debye
