program: Orca
programVersion: 5.0.2
elementType: Br Cl S P O O O C C C C C C C C C C C H H H H H H H H H H H H H H H
charge: 0
multiplicity: 1
keywords: wb97x-d3
keywords: def2-TZVPP
keywords: def2/J RIJCOSX
keywords: DEFGRID2
keywords: scfconv7
keywords: smallprint printgap noloewdin
keywords: NOSOSCF
formula: C11H15BrClO3PS
InChI: InChI=1/C11H15BrClO3PS/c1-3-7-18-17(14,15-4-2)16-11-6-5-9(12)8-10(11)13/h5-6,8H,3-4,7H2,1-2H3
33 atoms
Br 4.706175 1.617821 -0.825298
Cl 0.219552 1.580309 2.36511
S  -3.245419 -1.562229 1.229951
P  -1.751625 -0.864319 -0.012678
O  -0.455521 -0.897303 0.966892
O  -1.971379 0.710863 -0.109025
O  -1.596698 -1.596598 -1.283547
C  -3.531399 -3.217675 0.486992
C  -4.429146 -3.203026 -0.738028
C  -5.825972 -2.6654 -0.475018
C  0.710275 -0.329041 0.531893
C  -2.617728 1.321126 -1.233342
C  1.154746 0.845958 1.127043
C  1.463116 -0.915964 -0.472606
C  -4.121074 1.162181 -1.194848
C  2.351884 1.423383 0.733061
C  2.657036 -0.344202 -0.879157
C  3.090777 0.825357 -0.275095
H  -3.984898 -3.788762 1.299183
H  -2.568686 -3.675376 0.26814
H  -3.940416 -2.639999 -1.533213
H  -4.495663 -4.234647 -1.09684
H  -6.429006 -2.692058 -1.382188
H  -6.345421 -3.2544 0.282761
H  -5.798431 -1.632181 -0.127306
H  -2.339851 2.372685 -1.17583
H  -2.206635 0.916094 -2.159973
H  1.11259 -1.827746 -0.935636
H  -4.533471 1.507796 -0.247809
H  -4.567004 1.754725 -1.993965
H  -4.425511 0.126423 -1.343291
H  2.686692 2.334341 1.208606
H  3.235424 -0.810842 -1.663777
totalener: -4428.04455084 hartree
nucrepener: 2225.36355988 hartree
electener: -6653.40811072 hartree
twoeener: 3909.23580986 hartree
kineticenergy: 4419.47596098 hartree
xcener: -190.175202006485 hartree
chargesum: 0.0000000
charge: -0.020488 -0.048518 -0.145690 0.792515 -0.334948 -0.325619 -0.525557 -0.102315 -0.136686 -0.239567 0.198251 0.028454 -0.013449 -0.129734 -0.245924 -0.065270 -0.084856 -0.070512 0.114640 0.121616 0.086993 0.072640 0.090874 0.079248 0.067898 0.094702 0.097976 0.134940 0.095786 0.089960 0.073577 0.119441 0.129620
qa: -0.0205 -0.0485 -0.1457 0.7925 -0.3349 -0.3256 -0.5256 -0.1023 -0.1367 -0.2396 0.1983 0.0285 -0.0134 -0.1297 -0.2459 -0.0653 -0.0849 -0.0705 0.1146 0.1216 0.0870 0.0726 0.0909 0.0792 0.0679 0.0947 0.0980 0.1349 0.0958 0.0900 0.0736 0.1194 0.1296
va: 1.2310 1.2628 2.2863 5.4860 2.1550 2.1303 2.0704 3.8614 3.9028 3.9158 3.9090 3.8973 4.0310 4.0124 3.9263 3.9113 3.9031 4.0483 1.0064 1.0255 1.0216 1.0105 1.0057 1.0045 1.0159 0.9904 1.0032 1.0184 1.0026 1.0156 1.0034 1.0144 1.0016
dispcorr: -0.017212948 hartree
energy: -4428.061763783830
dipole: -84.28240 83.35809 -0.92431 -30.95514 30.78710 -0.16804 -5.56180 5.16439 -0.39740
magnitude: 1.02006 au
magnitude: 2.59277 debye
