program: Gaussian 09
title: 000066222
version: EM64L-G09RevD.01
frameworkgroup: C1[X(C2H3Br3)]
method: RPBEPBE
basis: SDD
operation: Freq
keyword: #pfreq=noraman
keyword: PBEPBE/SDD
title: #p freq=noraman PBEPBE/SDD
converged: YES YES NO NO
title: Mulliken charges:
elementType: Br Br Br C C H H H
charge: 0.074896 0.109747 0.042698 -0.629659 -0.599657 0.365944 0.322706 0.313325
chargesum: 0.00000
title: Mulliken charges with hydrogens summed into heavy atoms:
elementType: Br Br Br C C
charge: 0.074896 0.109747 0.042698 -0.263716 0.036374
polarizability: 1.01974175e+02 -1.33460775e+01 7.04408937e+01 4.69692949e+00 -9.20125245e-02 3.50069029e+01
1716.lowfreq: -8.8439 -5.3936 0.0002 0.0004 0.0004 3.1384 77.4221 127.8318 152.4844
frequency: 77.4192 127.8313 152.4841 191.5049 319.0915 528.7915 556.2264 629.9694 883.7470 1056.5969 1116.6938 1146.1525 1227.9935 1273.8377 1428.0948 3066.0718 3131.6419 3160.6159
redmass: 11.6731 6.2485 9.9413 39.0399 3.5014 4.4338 7.7036 5.1063 1.4337 3.3025 1.1978 1.0677 1.1436 1.1904 1.0932 1.0569 1.0905 1.1087
irintensity: 1.1154 3.0601 2.1380 0.7216 9.8043 26.9595 133.1027 23.5313 34.2891 3.5890 5.0474 30.2232 26.1921 9.2242 11.7672 2.2601 0.2963 0.4181
temp: 298.150 k
press: 1.00000 atm
elementType: 35 35 35 6 6 1 1 1
symmnumber: 1
zpe: 120073.8 jmol-1
zpe.correction: 0.045734 hartree
zpe.thermalcorrener: 0.052336 hartree
zpe.thermalcorrenthalpy: 0.053281 hartree
zpe.thermalcorrgfe: 0.010993 hartree
zpe.sumelectzpe: -117.979227 hartree
zpe.sumelectthermal: -117.972624 hartree
zpe.sumelectthermalent: -117.971680 hartree
zpe.sumelectthermalfe: -118.013968 hartree
dipole: 0.1423 -1.2386 -0.0084
dipole: 1.2467
quadrupole: -62.9012 -57.1657 -56.6889
quadrupole: -0.7211 0.1793 -0.3137
quadrupole: -3.9826 1.7529 2.2297 -0.7211 0.1793 -0.3137
hfenergy: -118.0249608 hartree
pointgroup: C01 [X(C2H3Br3)]
dipole: 0.0471561 -0.4859925 -0.0467339 debye
dipolederiv: -0.7488177 0.2977471 0.017292 0.2254238 -0.2949225 0.0046931 0.0047547 0.0539529 -0.0611258 -0.0870658 0.0313526 0.0267565 0.0331196 -0.6727913 -0.06323 0.0341876 -0.1486922 -0.0665435 -0.6330495 -0.0053143 -0.0166856 0.0314493 -0.0737911 0.0190703 -0.0595157 0.0123227 -0.1070939 0.8336266 -0.4207925 -0.0129145 -0.1993381 1.1995623 0.1463382 -0.0564096 0.125791 0.063638 0.7459224 0.0001717 0.1531426 -0.1501227 -0.1702247 -0.0296081 0.0655946 -0.0444223 0.0642184 -0.0317531 0.0572136 -0.0553845 0.0116679 -0.0776373 -0.0430142 0.0240262 -0.0118242 0.0106041 -0.0207098 0.0186071 -0.0878342 0.0289643 0.1193957 -0.0083893 -0.0085289 0.0040909 -0.0106872 -0.0581531 0.0210148 -0.0243724 0.0188358 -0.0295912 -0.02586 -0.004109 0.0087811 0.1069899 unknown
polarizability: 101.0613703|-14.4881445|70.7589613|5.7174421|2.608734|35.6016397 unknown
InChI: InChI=1S/C2H3Br3/c3-1-2(4)5/h2H,1H2
charge 0 multiplicity 1
8 atoms
Br 2.248582 -0.843292 -0.043154
Br 0.409598 1.911851 0.198498
Br -2.47882 -0.341133 -0.201764
C  0.426638 -0.003673 -0.383613
C  -0.59924 -0.852093 0.350969
H  0.3052 0.002753 -1.474899
H  -0.548441 -0.724546 1.441297
H  -0.500317 -1.911267 0.068266
