program: Orca
programVersion: 5.0.2
elementType: Br Cl S P O O O C C C C C C C C C C C H H H H H H H H H H H H H H H
charge: 0
multiplicity: 1
keywords: wb97x-d3
keywords: def2-TZVPP
keywords: def2/J RIJCOSX
keywords: DEFGRID2
keywords: scfconv7
keywords: smallprint printgap noloewdin
keywords: NOSOSCF
formula: C11H15BrClO3PS
InChI: InChI=1/C11H15BrClO3PS/c1-3-7-18-17(14,15-4-2)16-11-6-5-9(12)8-10(11)13/h5-6,8H,3-4,7H2,1-2H3
33 atoms
Br 4.783429 1.26382 0.453427
Cl 0.642787 -1.436643 -1.953837
S  -3.659558 -1.276211 -0.022913
P  -2.083204 0.049547 0.01867
O  -0.840199 -0.862583 0.540422
O  -2.410636 0.885919 1.340955
O  -1.80854 0.812324 -1.20902
C  -3.380533 -2.075884 -1.651123
C  -2.582423 -3.365283 -1.553938
C  -3.275209 -4.455466 -0.753089
C  0.424056 -0.344876 0.503616
C  -3.221919 2.069692 1.253591
C  1.236439 -0.556216 -0.604165
C  0.91986 0.356634 1.589605
C  -2.380429 3.299591 1.005289
C  2.537233 -0.078736 -0.62233
C  2.217195 0.839843 1.584186
C  3.017337 0.619188 0.473921
H  -2.906073 -1.349088 -2.310302
H  -4.380807 -2.264548 -2.044436
H  -2.407927 -3.715288 -2.575928
H  -1.599022 -3.155748 -1.131805
H  -2.681372 -5.368871 -0.745238
H  -3.425596 -4.154045 0.283866
H  -4.251438 -4.701201 -1.174941
H  -3.982629 1.955391 0.476329
H  -3.740825 2.132366 2.20944
H  0.283229 0.512534 2.449842
H  -3.015471 4.185501 1.018594
H  -1.621849 3.420457 1.778281
H  -1.887123 3.250506 0.036467
H  3.156985 -0.252227 -1.490678
H  2.593419 1.382038 2.439985
totalener: -4428.04496257 hartree
nucrepener: 2245.74615804 hartree
electener: -6673.79112061 hartree
twoeener: 3929.58425889 hartree
kineticenergy: 4419.47321854 hartree
xcener: -190.172751572445 hartree
chargesum: -0.0000000
charge: -0.018188 -0.056098 -0.160049 0.767893 -0.338527 -0.348909 -0.497794 -0.115645 -0.098256 -0.246195 0.230189 0.030384 0.043338 -0.177853 -0.242252 -0.077370 -0.070616 -0.070552 0.128706 0.114680 0.072065 0.053948 0.086966 0.082671 0.074140 0.086724 0.094986 0.134852 0.085608 0.077878 0.102798 0.121834 0.128646
qa: -0.0182 -0.0561 -0.1600 0.7679 -0.3385 -0.3489 -0.4978 -0.1156 -0.0983 -0.2462 0.2302 0.0304 0.0433 -0.1779 -0.2423 -0.0774 -0.0706 -0.0706 0.1287 0.1147 0.0721 0.0539 0.0870 0.0827 0.0741 0.0867 0.0950 0.1349 0.0856 0.0779 0.1028 0.1218 0.1286
va: 1.2332 1.2560 2.2957 5.5457 2.0979 2.1124 2.0988 3.8674 3.8799 3.9433 3.8551 3.8989 4.0187 4.0428 3.9207 3.9282 3.8869 4.0597 1.0315 1.0050 1.0085 1.0391 1.0065 1.0137 1.0033 1.0037 0.9917 1.0120 1.0114 1.0047 1.0189 1.0104 1.0007
dispcorr: -0.017286365 hartree
energy: -4428.062248934082
dipole: -71.80425 71.12330 -0.68095 -17.22557 17.20965 -0.01592 -2.26750 2.80284 0.53533
magnitude: 0.86633 au
magnitude: 2.20203 debye
