program: Orca
programVersion: 5.0.2
elementType: Br Cl S P O O O C C C C C C C C C C C H H H H H H H H H H H H H H H
charge: 0
multiplicity: 1
keywords: wb97x-d3
keywords: def2-TZVPP
keywords: def2/J RIJCOSX
keywords: DEFGRID2
keywords: scfconv7
keywords: smallprint printgap noloewdin
keywords: NOSOSCF
formula: C11H15BrClO3PS
InChI: InChI=1/C11H15BrClO3PS/c1-3-7-18-17(14,15-4-2)16-11-6-5-9(12)8-10(11)13/h5-6,8H,3-4,7H2,1-2H3
33 atoms
Br 4.757067 1.288782 0.452469
Cl 0.628888 -1.42819 -1.958605
S  -3.681516 -1.282357 -0.01022
P  -2.105095 0.044305 0.017128
O  -0.857933 -0.864206 0.536132
O  -2.424615 0.886272 1.337745
O  -1.837868 0.801173 -1.215811
C  -3.425258 -2.072924 -1.646061
C  -2.607547 -3.351558 -1.572032
C  -3.25971 -4.449925 -0.748593
C  0.40393 -0.340411 0.500022
C  -3.242237 2.065379 1.251373
C  1.217638 -0.546633 -0.607764
C  0.896535 0.362475 1.587063
C  -2.412839 3.296015 0.969695
C  2.516552 -0.063323 -0.624711
C  2.191833 0.851861 1.58249
C  2.993563 0.635527 0.472511
H  -2.975073 -1.337581 -2.312224
H  -4.431317 -2.274204 -2.017201
H  -2.460323 -3.700638 -2.598565
H  -1.614536 -3.128728 -1.180834
H  -4.24591 -4.708174 -1.137417
H  -2.654215 -5.355478 -0.760618
H  -3.37877 -4.149757 0.292481
H  -4.018385 1.936674 0.492111
H  -3.741574 2.13927 2.217062
H  0.259081 0.513922 2.447498
H  -3.05266 4.178475 0.986483
H  -1.63862 3.430558 1.724209
H  -1.940146 3.237838 -0.00865
H  3.137451 -0.23347 -1.492976
H  2.565409 1.394979 2.438982
totalener: -4428.04499522 hartree
nucrepener: 2245.94458436 hartree
electener: -6673.98957959 hartree
twoeener: 3929.78578975 hartree
kineticenergy: 4419.47327442 hartree
xcener: -190.172991709625 hartree
chargesum: -0.0000000
charge: -0.018379 -0.055753 -0.159938 0.768651 -0.338437 -0.348965 -0.498187 -0.115986 -0.098756 -0.246269 0.230357 0.030357 0.042644 -0.177280 -0.242234 -0.077286 -0.070983 -0.070370 0.129248 0.114626 0.071908 0.053915 0.074272 0.086961 0.083055 0.086301 0.094923 0.134707 0.085414 0.078001 0.103063 0.121737 0.128681
qa: -0.0184 -0.0558 -0.1599 0.7687 -0.3384 -0.3490 -0.4982 -0.1160 -0.0988 -0.2463 0.2304 0.0304 0.0426 -0.1773 -0.2422 -0.0773 -0.0710 -0.0704 0.1292 0.1146 0.0719 0.0539 0.0743 0.0870 0.0831 0.0863 0.0949 0.1347 0.0854 0.0780 0.1031 0.1217 0.1287
va: 1.2329 1.2563 2.2957 5.5434 2.0984 2.1124 2.0986 3.8688 3.8788 3.9424 3.8553 3.8990 4.0195 4.0418 3.9204 3.9280 3.8869 4.0594 1.0314 1.0046 1.0088 1.0404 1.0034 1.0066 1.0137 1.0039 0.9915 1.0121 1.0113 1.0047 1.0192 1.0104 1.0007
dispcorr: -0.017276053 hartree
energy: -4428.062271276168
dipole: -71.76861 71.07829 -0.69032 -17.42099 17.40915 -0.01184 -2.36580 2.89973 0.53393
magnitude: 0.87279 au
magnitude: 2.21846 debye
