program: Orca
programVersion: 5.0.2
elementType: Br Cl S P O O O C C C C C C C C C C C H H H H H H H H H H H H H H H
charge: 0
multiplicity: 1
keywords: wb97x-d3
keywords: def2-TZVPP
keywords: def2/J RIJCOSX
keywords: DEFGRID2
keywords: scfconv7
keywords: smallprint printgap noloewdin
keywords: NOSOSCF
formula: C11H15BrClO3PS
InChI: InChI=1/C11H15BrClO3PS/c1-3-7-18-17(14,15-4-2)16-11-6-5-9(12)8-10(11)13/h5-6,8H,3-4,7H2,1-2H3
33 atoms
Br 4.236081 -1.053653 -0.513995
Cl 0.023288 0.303605 2.75143
S  -2.787635 -0.961901 0.671218
P  -2.463019 0.812755 -0.332217
O  -1.138402 1.496906 0.353212
O  -3.579843 1.743414 0.30069
O  -2.36098 0.709128 -1.799893
C  -2.446809 -2.163729 -0.671835
C  -0.974588 -2.478319 -0.870546
C  -0.29908 -3.087001 0.347402
C  0.08663 0.943369 0.135112
C  -3.708461 3.122074 -0.096403
C  0.750288 0.33628 1.196559
C  0.689422 0.977685 -1.114164
C  -4.562174 3.268372 -1.334778
C  1.993925 -0.247523 1.010727
C  1.929516 0.394456 -1.312219
C  2.568923 -0.224787 -0.249051
H  -2.906584 -1.796033 -1.586924
H  -2.995398 -3.054477 -0.359447
H  -0.907651 -3.173794 -1.712472
H  -0.447683 -1.577159 -1.187952
H  -0.764888 -4.033376 0.628249
H  0.754211 -3.282597 0.147886
H  -0.351891 -2.422567 1.209929
H  -4.166757 3.620312 0.756733
H  -2.723468 3.572065 -0.243274
H  0.177327 1.452077 -1.939178
H  -5.546957 2.826607 -1.187541
H  -4.699374 4.327027 -1.557068
H  -4.097477 2.7975 -2.199088
H  2.489598 -0.722134 1.845868
H  2.382265 0.418327 -2.29347
totalener: -4428.04574138 hartree
nucrepener: 2311.14301381 hartree
electener: -6739.18875520 hartree
twoeener: 3994.88063517 hartree
kineticenergy: 4419.46955071 hartree
xcener: -190.177260751342 hartree
chargesum: -0.0000000
charge: -0.017030 -0.044097 -0.142828 0.791082 -0.339963 -0.328311 -0.525323 -0.113780 -0.098750 -0.262695 0.192968 0.018162 -0.026544 -0.111645 -0.233090 -0.072183 -0.087271 -0.058801 0.128640 0.112309 0.078107 0.061806 0.089053 0.091011 0.076123 0.096519 0.086325 0.131137 0.085384 0.080967 0.094163 0.118408 0.130148
qa: -0.0170 -0.0441 -0.1428 0.7911 -0.3400 -0.3283 -0.5253 -0.1138 -0.0987 -0.2627 0.1930 0.0182 -0.0265 -0.1116 -0.2331 -0.0722 -0.0873 -0.0588 0.1286 0.1123 0.0781 0.0618 0.0891 0.0910 0.0761 0.0965 0.0863 0.1311 0.0854 0.0810 0.0942 0.1184 0.1301
va: 1.2322 1.2647 2.3008 5.4900 2.0964 2.1623 2.0699 3.8863 3.8853 3.9345 3.8889 3.9237 3.9825 3.9630 3.9064 3.8712 3.8883 4.0045 1.0289 1.0063 1.0129 1.0243 1.0084 1.0049 1.0145 0.9907 1.0009 1.0242 1.0057 1.0098 1.0210 1.0168 1.0019
dispcorr: -0.019976420 hartree
energy: -4428.065717804120
dipole: -59.44170 59.16686 -0.27484 7.79943 -7.58964 0.20979 -7.76753 7.55543 -0.21210
magnitude: 0.40563 au
magnitude: 1.03103 debye
