program: Orca
programVersion: 5.0.2
elementType: Br Cl S P O O O C C C C C C C C C C C H H H H H H H H H H H H H H H
charge: 0
multiplicity: 1
keywords: wb97x-d3
keywords: def2-TZVPP
keywords: def2/J RIJCOSX
keywords: DEFGRID2
keywords: scfconv7
keywords: smallprint printgap noloewdin
keywords: NOSOSCF
formula: C11H15BrClO3PS
InChI: InChI=1/C11H15BrClO3PS/c1-3-7-18-17(14,15-4-2)16-11-6-5-9(12)8-10(11)13/h5-6,8H,3-4,7H2,1-2H3
33 atoms
Br 4.230148 -1.057223 -0.523495
Cl 0.021432 0.316175 2.740168
S  -2.793433 -0.962985 0.672709
P  -2.471594 0.807148 -0.33905
O  -1.144437 1.494728 0.336927
O  -3.585236 1.740849 0.29504
O  -2.375282 0.696114 -1.806548
C  -2.45121 -2.172815 -0.662805
C  -0.978749 -2.487111 -0.859986
C  -0.304228 -3.093425 0.359711
C  0.08034 0.940719 0.12008
C  -3.715876 3.11738 -0.10903
C  0.745694 0.339584 1.183853
C  0.681215 0.968342 -1.130245
C  -4.580769 3.256868 -1.340458
C  1.989698 -0.243715 0.999689
C  1.921608 0.385236 -1.326603
C  2.563088 -0.227236 -0.260835
H  -2.91126 -1.810271 -1.579735
H  -2.999168 -3.062252 -0.345527
H  -0.910875 -3.18403 -1.700812
H  -0.451438 -1.586583 -1.178584
H  -0.352178 -2.425055 1.219453
H  -0.774092 -4.03634 0.645416
H  0.747669 -3.295095 0.15894
H  -4.165897 3.621249 0.745294
H  -2.731757 3.565375 -0.267503
H  0.167498 1.437837 -1.957062
H  -4.720897 4.31439 -1.566708
H  -4.123313 2.782204 -2.206635
H  -5.563808 2.815013 -1.182234
H  2.486743 -0.713355 1.836793
H  2.373241 0.404259 -2.308401
totalener: -4428.04576333 hartree
nucrepener: 2310.87476277 hartree
electener: -6738.92052610 hartree
twoeener: 3994.61075673 hartree
kineticenergy: 4419.47027672 hartree
xcener: -190.177357436211 hartree
chargesum: 0.0000000
charge: -0.017046 -0.044038 -0.143013 0.790883 -0.339809 -0.328280 -0.525262 -0.114062 -0.097994 -0.262774 0.192199 0.018302 -0.026686 -0.110764 -0.233134 -0.071918 -0.087566 -0.058646 0.128795 0.112247 0.078093 0.061040 0.076418 0.088801 0.091132 0.096527 0.086274 0.131157 0.081023 0.094089 0.085455 0.118421 0.130134
qa: -0.0170 -0.0440 -0.1430 0.7909 -0.3398 -0.3283 -0.5253 -0.1141 -0.0980 -0.2628 0.1922 0.0183 -0.0267 -0.1108 -0.2331 -0.0719 -0.0876 -0.0586 0.1288 0.1122 0.0781 0.0610 0.0764 0.0888 0.0911 0.0965 0.0863 0.1312 0.0810 0.0941 0.0855 0.1184 0.1301
va: 1.2322 1.2647 2.3007 5.4910 2.0967 2.1621 2.0704 3.8865 3.8858 3.9345 3.8895 3.9237 3.9822 3.9623 3.9066 3.8711 3.8887 4.0050 1.0288 1.0064 1.0129 1.0245 1.0144 1.0084 1.0049 0.9907 1.0009 1.0241 1.0097 1.0209 1.0057 1.0168 1.0019
dispcorr: -0.019968651 hartree
energy: -4428.065731983035
dipole: -59.47691 59.20492 -0.27199 7.71161 -7.50293 0.20868 -7.64967 7.43888 -0.21079
magnitude: 0.40244 au
magnitude: 1.02292 debye
