program: Orca
programVersion: 5.0.2
elementType: Br Cl S P O O O C C C C C C C C C C C H H H H H H H H H H H H H H H
charge: 0
multiplicity: 1
keywords: wb97x-d3
keywords: def2-TZVPP
keywords: def2/J RIJCOSX
keywords: DEFGRID2
keywords: scfconv7
keywords: smallprint printgap noloewdin
keywords: NOSOSCF
formula: C11H15BrClO3PS
InChI: InChI=1/C11H15BrClO3PS/c1-3-7-18-17(14,15-4-2)16-11-6-5-9(12)8-10(11)13/h5-6,8H,3-4,7H2,1-2H3
33 atoms
Br 4.451954 -0.736344 -0.108947
Cl 0.01034 0.865105 2.720455
S  -2.468235 -1.028627 0.874155
P  -2.429742 0.592323 -0.409701
O  -1.141122 1.447758 0.112111
O  -3.596937 1.531287 0.118202
O  -2.419815 0.284708 -1.852867
C  -2.876417 -2.395862 -0.281891
C  -1.711607 -3.35239 -0.480015
C  -0.486804 -2.715722 -1.113998
C  0.116836 0.932428 0.032014
C  -4.181948 2.545748 -0.714362
C  0.790165 0.625708 1.209792
C  0.744307 0.731919 -1.187237
C  -3.291033 3.756795 -0.875836
C  2.083682 0.130729 1.171656
C  2.035295 0.233897 -1.237667
C  2.696195 -0.063652 -0.055912
H  -3.195528 -1.967269 -1.23044
H  -3.731842 -2.906128 0.159773
H  -1.443808 -3.810291 0.474995
H  -2.078142 -4.165616 -1.113834
H  0.26359 -3.470379 -1.347339
H  -0.741792 -2.195379 -2.03766
H  -0.022989 -1.992394 -0.444541
H  -4.440179 2.119593 -1.685824
H  -5.108679 2.814841 -0.209523
H  0.214406 0.961939 -2.101318
H  -2.397113 3.532041 -1.456688
H  -3.83889 4.537279 -1.404614
H  -2.983552 4.155377 0.089967
H  2.593685 -0.100856 2.095946
H  2.512684 0.079198 -2.194815
totalener: -4428.04451982 hartree
nucrepener: 2292.88934986 hartree
electener: -6720.93386968 hartree
twoeener: 3976.78893175 hartree
kineticenergy: 4419.47435509 hartree
xcener: -190.177548370289 hartree
chargesum: 0.0000000
charge: -0.017990 -0.045271 -0.153473 0.788525 -0.332293 -0.325184 -0.523734 -0.109878 -0.092354 -0.233631 0.201194 0.012474 -0.005165 -0.149742 -0.234583 -0.063304 -0.081571 -0.061892 0.110737 0.117140 0.067191 0.067876 0.092842 0.088841 0.048996 0.095315 0.095467 0.133248 0.085038 0.085219 0.091052 0.119514 0.129397
qa: -0.0180 -0.0453 -0.1535 0.7885 -0.3323 -0.3252 -0.5237 -0.1099 -0.0924 -0.2336 0.2012 0.0125 -0.0052 -0.1497 -0.2346 -0.0633 -0.0816 -0.0619 0.1107 0.1171 0.0672 0.0679 0.0928 0.0888 0.0490 0.0953 0.0955 0.1332 0.0850 0.0852 0.0911 0.1195 0.1294
va: 1.2327 1.2673 2.3021 5.4994 2.1100 2.1524 2.0663 3.8814 3.8975 3.9291 3.8729 3.9155 3.9980 3.9566 3.9004 3.9168 3.8735 4.0332 1.0363 1.0086 1.0100 1.0103 1.0105 1.0078 1.0196 1.0020 0.9886 1.0218 1.0159 1.0106 1.0069 1.0146 1.0018
dispcorr: -0.018853268 hartree
energy: -4428.063373087805
dipole: -62.19665 61.62229 -0.57435 2.88193 -2.86731 0.01462 -14.11439 13.81280 -0.30159
magnitude: 0.64888 au
magnitude: 1.64933 debye
