program: Orca
programVersion: 5.0.2
elementType: Br Cl S P O O O C C C C C C C C C C C H H H H H H H H H H H H H H H
charge: 0
multiplicity: 1
keywords: wb97x-d3
keywords: def2-TZVPP
keywords: def2/J RIJCOSX
keywords: DEFGRID2
keywords: scfconv7
keywords: smallprint printgap noloewdin
keywords: NOSOSCF
formula: C11H15BrClO3PS
InChI: InChI=1/C11H15BrClO3PS/c1-3-7-18-17(14,15-4-2)16-11-6-5-9(12)8-10(11)13/h5-6,8H,3-4,7H2,1-2H3
33 atoms
Br 4.63157 0.125391 0.879494
Cl 0.482145 -0.416201 -2.689917
S  -1.770766 -1.427167 0.138094
P  -2.32475 0.526557 -0.287285
O  -1.006162 1.291127 -0.841478
O  -2.419821 1.172403 1.172265
O  -3.468869 0.682941 -1.195159
C  -2.399984 -2.283492 -1.358482
C  -3.858462 -2.690113 -1.257522
C  -4.147351 -3.667911 -0.130217
C  0.260082 1.021464 -0.422934
C  -3.571618 0.912212 1.991101
C  1.084624 0.231182 -1.216722
C  0.756285 1.551663 0.756478
C  -4.707848 1.860357 1.681177
C  2.389656 -0.0324 -0.836498
C  2.059788 1.296123 1.148645
C  2.865936 0.498565 0.351471
H  -1.750413 -3.155192 -1.455512
H  -2.219975 -1.650655 -2.224957
H  -4.472427 -1.794255 -1.161012
H  -4.13103 -3.144609 -2.214801
H  -3.915345 -3.235878 0.843755
H  -5.199145 -3.952153 -0.121588
H  -3.56062 -4.582387 -0.234631
H  -3.886158 -0.129669 1.876286
H  -3.227051 1.033454 3.017662
H  0.117538 2.174682 1.366993
H  -5.080284 1.719446 0.668373
H  -5.529892 1.679689 2.374488
H  -4.397222 2.898546 1.793883
H  3.015235 -0.650766 -1.464493
H  2.434525 1.716409 2.071167
totalener: -4428.04528518 hartree
nucrepener: 2257.32988686 hartree
electener: -6685.37517204 hartree
twoeener: 3940.86491524 hartree
kineticenergy: 4419.46533365 hartree
xcener: -190.175454724580 hartree
chargesum: 0.0000000
charge: -0.017475 -0.052675 -0.180642 0.780117 -0.321645 -0.333192 -0.506711 -0.112682 -0.110548 -0.239098 0.153559 0.033207 0.037489 -0.104075 -0.233817 -0.078852 -0.091511 -0.057070 0.119275 0.118165 0.082848 0.067752 0.072633 0.088177 0.073802 0.074611 0.094218 0.133466 0.099894 0.079473 0.082957 0.120034 0.128315
qa: -0.0175 -0.0527 -0.1806 0.7801 -0.3216 -0.3332 -0.5067 -0.1127 -0.1105 -0.2391 0.1536 0.0332 0.0375 -0.1041 -0.2338 -0.0789 -0.0915 -0.0571 0.1193 0.1182 0.0828 0.0678 0.0726 0.0882 0.0738 0.0746 0.0942 0.1335 0.0999 0.0795 0.0830 0.1200 0.1283
va: 1.2335 1.2636 2.2647 5.5243 2.1577 2.1093 2.1170 3.8768 3.9150 3.9221 3.8975 3.9073 3.9716 3.9982 3.9211 3.9463 3.9155 4.0507 1.0047 1.0285 1.0272 1.0108 1.0146 1.0069 1.0035 1.0048 0.9925 1.0151 1.0215 1.0096 1.0062 1.0141 1.0014
dispcorr: -0.017426485 hartree
energy: -4428.062711665076
dipole: -80.80565 80.55469 -0.25096 -11.30385 10.82290 -0.48094 0.70664 0.28570 0.99233
magnitude: 1.13093 au
magnitude: 2.87460 debye
