program: Orca
programVersion: 5.0.2
elementType: Br Cl S P O O O C C C C C C C C C C C H H H H H H H H H H H H H H H
charge: 0
multiplicity: 1
keywords: wb97x-d3
keywords: def2-TZVPP
keywords: def2/J RIJCOSX
keywords: DEFGRID2
keywords: scfconv7
keywords: smallprint printgap noloewdin
keywords: NOSOSCF
formula: C11H15BrClO3PS
InChI: InChI=1/C11H15BrClO3PS/c1-3-7-18-17(14,15-4-2)16-11-6-5-9(12)8-10(11)13/h5-6,8H,3-4,7H2,1-2H3
33 atoms
Br 4.224193 -1.282586 -0.331079
Cl 0.159047 0.593674 2.870352
S  -2.862062 -0.598289 1.032814
P  -2.356213 0.993309 -0.197977
O  -0.981638 1.637598 0.383987
O  -3.29792 2.170622 0.299032
O  -2.329404 0.644064 -1.630218
C  -2.571556 -2.022096 -0.076596
C  -1.115903 -2.443511 -0.16016
C  -0.951666 -3.709013 -0.989715
C  0.195318 0.974712 0.20299
C  -4.65984 2.23457 -0.149034
C  0.845547 0.430819 1.305693
C  0.7641 0.850452 -1.055923
C  -4.78152 3.002809 -1.445313
C  2.050969 -0.237189 1.151933
C  1.964321 0.181484 -1.221232
C  2.597577 -0.363834 -0.114858
H  -2.980141 -1.788242 -1.058588
H  -3.182543 -2.81734 0.355129
H  -0.528897 -1.638941 -0.606151
H  -0.721015 -2.595711 0.846367
H  -1.315441 -3.566051 -2.00808
H  0.097161 -3.997099 -1.053075
H  -1.498377 -4.547941 -0.556053
H  -5.076803 1.227782 -0.247051
H  -5.201895 2.731973 0.65416
H  0.259478 1.276679 -1.911552
H  -4.370428 4.007268 -1.346475
H  -4.266259 2.495205 -2.259187
H  -5.833908 3.097167 -1.715887
H  2.543114 -0.65456 2.019214
H  2.393966 0.087282 -2.208604
totalener: -4428.04719548 hartree
nucrepener: 2282.90764949 hartree
electener: -6710.95484497 hartree
twoeener: 3966.59701321 hartree
kineticenergy: 4419.47172809 hartree
xcener: -190.176421952125 hartree
chargesum: -0.0000000
charge: -0.016518 -0.040968 -0.164127 0.771755 -0.311629 -0.322579 -0.519890 -0.093413 -0.077738 -0.253418 0.151947 0.033114 0.005857 -0.093171 -0.240168 -0.084185 -0.087217 -0.062231 0.116970 0.109399 0.043613 0.068895 0.083040 0.090490 0.076972 0.075748 0.097692 0.130420 0.086565 0.094915 0.080869 0.118533 0.130455
qa: -0.0165 -0.0410 -0.1641 0.7718 -0.3116 -0.3226 -0.5199 -0.0934 -0.0777 -0.2534 0.1519 0.0331 0.0059 -0.0932 -0.2402 -0.0842 -0.0872 -0.0622 0.1170 0.1094 0.0436 0.0689 0.0830 0.0905 0.0770 0.0757 0.0977 0.1304 0.0866 0.0949 0.0809 0.1185 0.1305
va: 1.2337 1.2680 2.3036 5.5344 2.1470 2.1548 2.0739 3.8801 3.8960 3.9641 3.9311 3.9028 3.9912 3.9362 3.9252 3.9235 3.8897 4.0323 1.0273 1.0069 1.0260 1.0135 1.0019 1.0059 1.0040 1.0080 0.9905 1.0215 1.0047 1.0199 1.0099 1.0162 1.0020
dispcorr: -0.018496354 hartree
energy: -4428.065691831975
dipole: -65.01814 64.28079 -0.73734 4.16586 -4.47207 -0.30622 -11.36665 11.17945 -0.18720
magnitude: 0.82006 au
magnitude: 2.08441 debye
