program: Orca
programVersion: 5.0.2
elementType: Br Cl S P O O O C C C C C C C C C C C H H H H H H H H H H H H H H H
charge: 0
multiplicity: 1
keywords: wb97x-d3
keywords: def2-TZVPP
keywords: def2/J RIJCOSX
keywords: DEFGRID2
keywords: scfconv7
keywords: smallprint printgap noloewdin
keywords: NOSOSCF
formula: C11H15BrClO3PS
InChI: InChI=1/C11H15BrClO3PS/c1-3-7-18-17(14,15-4-2)16-11-6-5-9(12)8-10(11)13/h5-6,8H,3-4,7H2,1-2H3
33 atoms
Br 4.647674 0.556187 1.068945
Cl 0.584792 -1.029901 -2.287916
S  -1.857391 -1.487677 0.404798
P  -2.323876 0.425501 -0.240872
O  -0.996581 1.040441 -0.940021
O  -2.325086 1.24341 1.131902
O  -3.488647 0.535323 -1.128539
C  -2.536239 -2.474427 -0.981283
C  -4.020867 -2.757874 -0.841815
C  -4.522547 -3.645414 -1.973001
C  0.263374 0.908179 -0.441953
C  -3.468614 1.190393 1.999776
C  1.128592 -0.024768 -1.004439
C  0.719863 1.729383 0.57682
C  -4.495592 2.234626 1.62633
C  2.435117 -0.137022 -0.555651
C  2.022649 1.62827 1.033589
C  2.872201 0.692694 0.464284
H  -1.953224 -3.396887 -0.96263
H  -2.30942 -1.973336 -1.921568
H  -4.210102 -3.236573 0.121582
H  -4.564862 -1.813594 -0.842335
H  -5.590724 -3.835615 -1.872896
H  -4.363602 -3.177263 -2.945241
H  -4.015792 -4.611783 -1.982778
H  -3.904317 0.186827 1.989064
H  -3.077608 1.362435 3.002313
H  0.052134 2.462624 1.006241
H  -4.911629 2.047417 0.638088
H  -5.312348 2.216952 2.348481
H  -4.062524 3.234462 1.636113
H  3.093118 -0.867149 -1.005297
H  2.36587 2.278391 1.825764
totalener: -4428.04613821 hartree
nucrepener: 2243.01589400 hartree
electener: -6671.06203221 hartree
twoeener: 3926.58076427 hartree
kineticenergy: 4419.46122429 hartree
xcener: -190.173773318161 hartree
chargesum: -0.0000000
charge: -0.016802 -0.053244 -0.171005 0.772795 -0.319012 -0.335111 -0.506629 -0.096831 -0.094133 -0.254630 0.159386 0.029704 0.034645 -0.102291 -0.232573 -0.078963 -0.091559 -0.061947 0.116678 0.104434 0.058465 0.081131 0.087315 0.084034 0.072609 0.079493 0.095006 0.127844 0.099307 0.079959 0.081431 0.121733 0.128763
qa: -0.0168 -0.0532 -0.1710 0.7728 -0.3190 -0.3351 -0.5066 -0.0968 -0.0941 -0.2546 0.1594 0.0297 0.0346 -0.1023 -0.2326 -0.0790 -0.0916 -0.0619 0.1167 0.1044 0.0585 0.0811 0.0873 0.0840 0.0726 0.0795 0.0950 0.1278 0.0993 0.0800 0.0814 0.1217 0.1288
va: 1.2345 1.2619 2.2800 5.5311 2.1613 2.1022 2.1147 3.8754 3.9013 3.9597 3.9021 3.8979 3.9746 3.9968 3.9260 3.9387 3.9117 4.0554 1.0065 1.0267 1.0127 1.0295 1.0066 1.0026 1.0029 1.0080 0.9923 1.0174 1.0210 1.0100 1.0054 1.0131 1.0012
dispcorr: -0.016973235 hartree
energy: -4428.063111444840
dipole: -81.98329 81.69177 -0.29153 -12.64624 12.38284 -0.26340 -5.65732 6.67451 1.01719
magnitude: 1.09043 au
magnitude: 2.77166 debye
