program: Orca
programVersion: 5.0.2
elementType: Br Cl S P O O O C C C C C C C C C C C H H H H H H H H H H H H H H H
charge: 0
multiplicity: 1
keywords: wb97x-d3
keywords: def2-TZVPP
keywords: def2/J RIJCOSX
keywords: DEFGRID2
keywords: scfconv7
keywords: smallprint printgap noloewdin
keywords: NOSOSCF
formula: C11H15BrClO3PS
InChI: InChI=1/C11H15BrClO3PS/c1-3-7-18-17(14,15-4-2)16-11-6-5-9(12)8-10(11)13/h5-6,8H,3-4,7H2,1-2H3
33 atoms
Br 4.965841 0.38646 -0.611178
Cl 0.224302 2.906902 0.605534
S  -2.209274 -2.298272 0.724305
P  -2.001372 -0.372767 -0.00125
O  -0.831947 0.21789 0.971212
O  -3.274039 0.381766 0.582171
O  -1.734746 -0.244419 -1.442564
C  -2.999523 -3.081495 -0.731646
C  -4.424842 -2.630653 -1.007227
C  -5.373775 -2.79967 0.1676
C  0.47643 0.225049 0.588837
C  -3.599952 1.707787 0.120816
C  1.109681 1.44699 0.397034
C  1.19705 -0.946434 0.422612
C  -4.559609 1.65612 -1.044808
C  2.450141 1.50258 0.051134
C  2.534326 -0.905682 0.067948
C  3.15241 0.320479 -0.118229
H  -2.970641 -4.146101 -0.491837
H  -2.356907 -2.917577 -1.59515
H  -4.420783 -1.592342 -1.344381
H  -4.780701 -3.21643 -1.859984
H  -5.39956 -3.834141 0.514249
H  -5.07979 -2.173456 1.009124
H  -6.38919 -2.521631 -0.113842
H  -4.048956 2.206412 0.97916
H  -2.695094 2.260516 -0.142513
H  0.708407 -1.899304 0.578304
H  -5.460862 1.099327 -0.788864
H  -4.858684 2.668677 -1.317341
H  -4.096333 1.196694 -1.916178
H  2.92567 2.462568 -0.091625
H  3.082188 -1.828361 -0.060447
totalener: -4428.04493696 hartree
nucrepener: 2223.35685482 hartree
electener: -6651.40179179 hartree
twoeener: 3907.05540110 hartree
kineticenergy: 4419.46861662 hartree
xcener: -190.172978774156 hartree
chargesum: -0.0000000
charge: -0.019261 -0.061650 -0.156546 0.750801 -0.350949 -0.316428 -0.497666 -0.131718 -0.103061 -0.244411 0.217431 0.049872 0.016255 -0.113066 -0.266568 -0.072917 -0.093267 -0.069004 0.113854 0.132185 0.064581 0.076735 0.076231 0.087317 0.085528 0.094669 0.080271 0.123881 0.085714 0.091789 0.101099 0.120796 0.127505
qa: -0.0193 -0.0616 -0.1565 0.7508 -0.3509 -0.3164 -0.4977 -0.1317 -0.1031 -0.2444 0.2174 0.0499 0.0163 -0.1131 -0.2666 -0.0729 -0.0933 -0.0690 0.1139 0.1322 0.0646 0.0767 0.0762 0.0873 0.0855 0.0947 0.0803 0.1239 0.0857 0.0918 0.1011 0.1208 0.1275
va: 1.2324 1.2514 2.2820 5.5306 2.1316 2.1032 2.0867 3.9039 3.8803 3.9307 3.8717 3.8801 4.0210 4.0238 3.9247 3.9266 3.9590 4.0602 1.0025 1.0228 1.0195 1.0099 1.0049 1.0141 1.0065 0.9937 1.0126 1.0282 1.0012 1.0139 1.0130 1.0123 1.0030
dispcorr: -0.017459023 hartree
energy: -4428.062395986781
dipole: -87.73059 86.76659 -0.96401 -18.56355 18.13265 -0.43090 -1.23472 1.30022 0.06550
magnitude: 1.05795 au
magnitude: 2.68911 debye
