program: Orca
programVersion: 5.0.2
elementType: Br Cl S P O O O C C C C C C C C C C C H H H H H H H H H H H H H H H
charge: 0
multiplicity: 1
keywords: wb97x-d3
keywords: def2-TZVPP
keywords: def2/J RIJCOSX
keywords: DEFGRID2
keywords: scfconv7
keywords: smallprint printgap noloewdin
keywords: NOSOSCF
formula: C11H15BrClO3PS
InChI: InChI=1/C11H15BrClO3PS/c1-3-7-18-17(14,15-4-2)16-11-6-5-9(12)8-10(11)13/h5-6,8H,3-4,7H2,1-2H3
33 atoms
Br 4.69293 1.140329 0.439312
Cl -0.039305 -1.273749 1.865686
S  -3.684806 -1.086679 -1.247795
P  -2.090613 0.213473 -1.175658
O  -0.835866 -0.787929 -0.911802
O  -2.106692 0.975893 0.231654
O  -2.019361 1.062189 -2.374654
C  -3.578285 -1.965995 0.357167
C  -2.821364 -3.279914 0.272019
C  -2.820249 -4.000966 1.612926
C  0.398696 -0.293419 -0.608065
C  -2.663183 2.294516 0.341108
C  0.912235 -0.485893 0.668661
C  1.16597 0.352717 -1.564147
C  -4.174763 2.296305 0.288272
C  2.192556 -0.061464 0.984927
C  2.44537 0.786199 -1.258996
C  2.951233 0.573139 0.014272
H  -4.617356 -2.134445 0.645901
H  -3.145842 -1.300187 1.104009
H  -3.277234 -3.912378 -0.492459
H  -1.797463 -3.091408 -0.04901
H  -2.269172 -4.938707 1.549628
H  -2.348845 -3.3969 2.389318
H  -3.832352 -4.236238 1.945667
H  -2.309456 2.666607 1.301893
H  -2.247668 2.932903 -0.440604
H  0.760848 0.503842 -2.555437
H  -4.539522 3.307091 0.473458
H  -4.548939 1.984608 -0.686264
H  -4.602089 1.64125 1.046967
H  2.58028 -0.226439 1.98019
H  3.037272 1.282862 -2.014664
totalener: -4428.04572094 hartree
nucrepener: 2258.56372233 hartree
electener: -6686.60944327 hartree
twoeener: 3941.98613560 hartree
kineticenergy: 4419.46154685 hartree
xcener: -190.172481866957 hartree
chargesum: 0.0000000
charge: -0.016726 -0.067223 -0.135123 0.754066 -0.347018 -0.319476 -0.505762 -0.107206 -0.116857 -0.239014 0.223077 0.026667 0.017770 -0.155191 -0.252528 -0.073234 -0.068619 -0.078359 0.117342 0.094180 0.073683 0.073704 0.091119 0.070812 0.078478 0.091401 0.100114 0.144398 0.089596 0.096219 0.085130 0.122729 0.131848
qa: -0.0167 -0.0672 -0.1351 0.7541 -0.3470 -0.3195 -0.5058 -0.1072 -0.1169 -0.2390 0.2231 0.0267 0.0178 -0.1552 -0.2525 -0.0732 -0.0686 -0.0784 0.1173 0.0942 0.0737 0.0737 0.0911 0.0708 0.0785 0.0914 0.1001 0.1444 0.0896 0.0962 0.0851 0.1227 0.1318
va: 1.2343 1.2472 2.2865 5.5180 2.1066 2.0781 2.1299 3.8554 3.8950 3.9411 3.8371 3.8906 3.9999 4.0644 3.9242 3.9217 3.8914 4.0590 1.0093 1.0364 1.0171 1.0288 1.0070 1.0040 1.0036 0.9901 1.0053 1.0119 1.0145 1.0120 1.0015 1.0106 0.9997
dispcorr: -0.018368880 hartree
energy: -4428.064089824527
dipole: -72.76809 72.29695 -0.47114 -17.27045 17.17957 -0.09088 0.30446 0.75013 1.05459
magnitude: 1.15861 au
magnitude: 2.94496 debye
