program: Gaussian 09
title: 000066261
version: EM64L-G09RevD.01
frameworkgroup: C1[X(C6H11N3O9)]
method: RPBEPBE
basis: SDD
operation: Freq
keyword: #p
keyword: freq=noraman
keyword: PBEPBE/SDD
title: #p freq=noraman PBEPBE/SDD
converged: YES YES NO NO
title: Mulliken charges:
elementType: O O O O O O O O O N N N C C C C C C H H H H H H H H H H H
charge: -0.201970 -0.201974 -0.218615 -0.134075 -0.134082 -0.132515 -0.122083 -0.122092 -0.125299 0.209789 0.209800 0.211238 0.233529 -0.391030 -0.375619 -0.375687 -0.330567 -0.726502 0.234270 0.234264 0.273449 0.244591 0.273523 0.244551 0.266405 0.266448 0.226760 0.236720 0.226774
chargesum: 0.00000
title: Mulliken charges with hydrogens summed into heavy atoms:
elementType: O O O O O O O O O N N N C C C C C C
charge: -0.201970 -0.201974 -0.218615 -0.134075 -0.134082 -0.132515 -0.122083 -0.122092 -0.125299 0.209789 0.209800 0.211238 0.233529 0.077504 0.142421 0.142388 0.202286 -0.036248
polarizability: 1.64129641e+02 6.28907685e-03 1.26732987e+02 -2.17102350e-03 4.59138487e-01 1.23513239e+02
1716.lowfreq: -9.0888 -5.4084 0.0006 0.0008 0.0009 8.5687 18.1519 23.7048 31.4551
frequency: 18.0466 23.7018 31.4547 36.3051 44.0669 56.4944 56.6142 88.2005 104.0845 138.1638 142.8652 153.9664 177.8093 192.8828 222.1738 239.7622 246.9434 275.3032 317.4662 320.1814 345.1802 478.1298 502.3510 515.3854 530.8169 558.3456 599.3064 628.6262 637.4835 638.6878 638.8313 658.5984 745.1804 749.2975 753.7981 785.2936 786.2398 881.1130 910.1848 929.7986 929.9326 961.0049 966.3412 1008.6884 1056.5302 1059.9853 1138.1195 1160.7465 1161.9947 1162.2088 1173.5022 1203.2804 1213.2130 1230.2257 1260.4367 1304.3679 1349.1591 1355.6430 1359.5812 1366.9713 1398.9362 1461.4678 1462.8327 1467.8336 1479.0630 1484.9837 1493.8316 1530.9631 1531.0572 1533.7126 2990.0025 3007.8440 3010.6904 3016.0856 3026.6865 3058.2317 3078.4206 3082.8792 3086.9313 3089.0689 3102.2216
redmass: 10.4715 10.8240 10.3649 7.2811 13.0699 4.1871 7.7190 4.0060 5.5271 9.9602 8.3369 3.0482 2.8554 12.8668 8.3658 2.3609 4.3390 1.6226 3.3430 1.9842 4.4153 4.9131 2.8347 5.7834 8.0676 6.7492 13.1595 7.1102 14.0072 13.6110 13.7681 5.2166 13.3934 14.1530 8.3165 1.2461 3.7030 2.3462 1.9293 6.9739 8.3061 1.5087 8.8120 1.7908 2.6306 1.6064 1.8825 1.7270 11.0574 11.1504 11.5423 1.0706 6.5311 1.1668 1.2497 1.1635 1.4371 1.3064 1.4451 1.3204 1.2057 1.0771 1.0748 1.0645 1.0861 1.0603 1.0453 13.4919 13.5476 12.5335 1.0361 1.0599 1.0551 1.0555 1.0558 1.1015 1.1082 1.1035 1.1030 1.1018 1.1096
irintensity: 0.4114 1.1286 0.0506 0.1024 1.1859 0.2707 1.6433 0.0498 0.9724 1.0682 3.3582 0.0103 0.5687 0.1406 0.6367 3.9687 3.9383 0.1701 1.2692 0.5031 5.8364 22.1430 10.8765 10.7330 0.6837 0.6512 2.9040 25.2499 0.0978 17.6005 2.4623 23.4044 246.6102 536.9415 35.3117 38.8344 44.0157 10.5963 33.2721 40.5191 40.3183 0.1574 0.5413 6.9666 10.7495 0.0091 0.0017 0.0230 471.9661 281.9885 91.1452 0.0539 0.2603 0.2050 1.4554 0.2446 7.7951 2.9102 7.7934 0.4308 12.5609 4.7352 7.6393 2.7319 26.0961 7.9313 20.3402 53.4243 162.5819 445.5235 21.3032 12.3902 4.0520 17.0581 6.2100 0.6503 3.0913 37.0256 18.8873 44.8755 16.1106
temp: 298.150 k
press: 1.00000 atm
elementType: 8 8 8 8 8 8 8 8 8 7 7 7 6 6 6 6 6 6 1 1 1 1 1 1 1 1 1 1 1
symmnumber: 1
zpe: 526206.2 jmol-1
zpe.correction: 0.200421 hartree
zpe.thermalcorrener: 0.220028 hartree
zpe.thermalcorrenthalpy: 0.220972 hartree
zpe.thermalcorrgfe: 0.147677 hartree
zpe.sumelectzpe: -1074.711183 hartree
zpe.sumelectthermal: -1074.691576 hartree
zpe.sumelectthermalent: -1074.690632 hartree
zpe.sumelectthermalfe: -1074.763928 hartree
dipole: 0.0011 -3.2878 -0.7196
dipole: 3.3657
quadrupole: -129.7988 -109.0284 -107.8481
quadrupole: -0.0004 0.0008 1.0115
quadrupole: -14.2404 6.5301 7.7103 -0.0004 0.0008 1.0115
hfenergy: -1074.9116043 hartree
pointgroup: C01 [X(C6H11N3O9)]
dipole: 0.004955 1.2736581 0.3621498 debye
polarizability: 164.1288899|-0.0995673|126.6646982|-0.1388274|0.6536978|123.5822781 unknown
InChI: InChI=1S/C6H11N3O9/c1-2-6(3-16-7(10)11,4-17-8(12)13)5-18-9(14)15/h2-5H2,1H3
charge 0 multiplicity 1
29 atoms
O  2.42539 0.624383 0.357002
O  -2.413112 0.636257 0.373601
O  -0.00264 -1.729607 -0.346698
O  3.633833 1.177508 -1.620172
O  -3.632563 1.196505 -1.594782
O  -0.002406 -3.546254 1.190867
O  4.739828 0.607232 0.310396
O  -4.727867 0.632357 0.343663
O  -0.011743 -3.926991 -1.074061
N  3.733727 0.825031 -0.406607
N  -3.725723 0.844433 -0.380568
N  -0.005943 -3.223797 -0.034453
C  0.006169 0.581401 0.403633
C  0.01234 1.477346 1.685841
C  1.237553 0.854996 -0.502904
C  -1.230079 0.860512 -0.494617
C  0.004375 -0.893964 0.884202
C  0.01484 3.000599 1.434423
H  0.904006 1.210708 2.282721
H  -0.876752 1.214524 2.288202
H  1.267478 0.162018 -1.362029
H  1.244779 1.897247 -0.868308
H  -1.269355 0.167138 -1.353041
H  -1.234717 1.902545 -0.860683
H  -0.898497 -1.109007 1.480629
H  0.910758 -1.113622 1.473573
H  -0.882271 3.336746 0.883935
H  0.01818 3.531535 2.402571
H  0.910711 3.333121 0.879762
