program: Gaussian 09
title: 000066258
version: EM64L-G09RevD.01
frameworkgroup: C1[X(C14H20O)]
method: RPBEPBE
basis: SDD
operation: Freq
keyword: #pfreq=noraman
keyword: PBEPBE/SDD
title: #p freq=noraman PBEPBE/SDD
converged: NO YES NO NO
title: Mulliken charges:
elementType: O C C C C C C C C C C C C C C H H H H H H H H H H H H H H H H H H H H
charge: -0.250783 -0.208906 0.193079 -0.344485 -0.550872 -0.473692 -0.472745 0.510025 -0.753417 -0.736651 -0.461372 -0.137527 -0.322330 0.171464 -0.786662 0.238682 0.260144 0.241651 0.229082 0.222045 0.223572 0.230214 0.236941 0.216300 0.227702 0.210017 0.214150 0.217884 0.229020 0.231433 0.260123 0.221062 0.231309 0.231443 0.252099
chargesum: 0.00000
title: Mulliken charges with hydrogens summed into heavy atoms:
elementType: O C C C C C C C C C C C C C C
charge: -0.250783 0.029776 0.193079 -0.084341 -0.080139 -0.028076 -0.005589 0.510025 -0.099398 -0.075597 -0.229939 0.122596 -0.101268 0.171464 -0.071811
polarizability: 2.61292756e+02 3.33764159e+00 1.43544942e+02 3.65713584e+00 4.00610043e+00 1.10957886e+02
1716.lowfreq: -15.9302 -10.4540 -0.0003 0.0001 0.0007 4.9313 37.9444 49.0623 63.2454
frequency: 37.4745 48.9924 63.1977 81.8713 90.6791 156.7203 167.6798 197.7292 214.7700 217.6997 236.0072 251.8005 298.8582 327.4446 341.1190 372.4352 401.8738 432.5321 460.2064 495.6908 533.2937 574.3454 601.6385 637.7648 693.5731 736.3837 773.1702 812.2519 822.9799 844.0333 876.4321 881.7105 909.8779 912.8286 925.8909 932.3340 943.3184 949.0189 956.8101 967.3959 998.3813 999.4682 1012.1664 1025.2901 1036.4519 1052.8395 1100.9220 1125.7219 1142.5262 1154.2221 1159.6436 1177.3723 1197.8033 1211.8290 1218.7359 1227.6065 1259.5548 1263.3448 1273.0249 1283.8288 1292.2565 1301.4121 1310.0175 1363.1573 1368.4207 1377.4999 1397.7371 1442.8195 1456.8355 1460.4933 1463.1088 1471.6605 1477.2815 1481.6582 1492.5195 1505.9832 1556.2834 1614.4607 1650.4938 2976.6769 2976.9375 2979.4927 3003.6773 3017.6217 3018.9121 3056.3332 3059.8527 3062.9422 3065.0036 3071.9107 3078.5854 3080.6018 3085.0511 3087.3739 3089.0130 3093.0556 3103.2109 3111.3174 3121.7752
redmass: 3.2000 3.9069 4.1333 1.1369 3.1906 2.5594 3.8124 1.2227 2.7222 2.3907 1.3782 1.9914 2.2023 2.7348 2.5591 2.5159 2.8523 2.7574 2.2364 2.8308 3.5364 2.5706 4.1226 4.0011 3.4375 3.9273 3.4969 1.3647 2.6335 1.3893 2.4863 2.6396 3.3771 1.7278 2.4540 1.8460 1.6559 1.7570 1.8296 1.7963 1.3162 1.1792 1.4750 1.7768 1.6542 1.6465 1.1924 1.5624 2.2451 2.0471 1.6912 1.6026 2.0500 1.7712 2.0582 1.5508 1.4105 1.4881 1.6374 1.6430 1.5557 1.5790 1.6828 1.4467 1.6027 1.1910 1.1995 1.1001 1.0501 1.0548 1.0612 1.0731 1.0591 1.0699 1.0764 1.0796 6.5914 6.6500 6.7178 1.0358 1.0373 1.0361 1.0607 1.0629 1.0626 1.0885 1.0966 1.1020 1.0995 1.0982 1.0895 1.1022 1.0924 1.1014 1.0988 1.1006 1.0932 1.0866 1.0992
irintensity: 1.9870 4.6440 1.1828 0.0044 0.1627 0.3187 2.0526 0.0730 0.5204 0.3111 0.2307 0.5200 1.7866 2.1230 3.3036 1.5004 0.9577 3.4429 0.5862 9.1463 5.2765 0.2357 9.6832 1.8852 1.6676 3.2409 0.7304 7.9409 5.7101 2.0145 2.1168 13.4448 3.9463 15.6351 2.4025 4.2955 6.8573 62.8992 11.9996 0.4835 0.4888 47.8336 11.1489 1.5020 6.3688 3.4234 26.7471 6.9316 6.7081 15.4668 63.7435 8.2568 5.6524 11.7428 6.7995 24.9094 3.9599 25.1606 68.3090 2.4647 100.1631 5.5848 10.1036 7.2938 126.3988 15.4608 14.0627 35.9516 19.0926 1.4219 2.1602 6.9968 4.4602 20.7163 22.6057 3.7799 392.5815 36.4806 226.2551 23.0022 5.0555 46.6872 20.7157 53.2923 44.4341 62.7266 17.1048 1.8558 9.9125 73.8152 8.0228 2.9029 25.4572 78.0192 48.1780 12.8223 3.3811 18.6263 24.0202
temp: 298.150 k
press: 1.00000 atm
elementType: 8 6 6 6 6 6 6 6 6 6 6 6 6 6 6 1 1 1 1 1 1 1 1 1 1 1 1 1 1 1 1 1 1 1 1
symmnumber: 1
zpe: 793865.9 jmol-1
zpe.correction: 0.302368 hartree
zpe.thermalcorrener: 0.317938 hartree
zpe.thermalcorrenthalpy: 0.318882 hartree
zpe.thermalcorrgfe: 0.259246 hartree
zpe.sumelectzpe: -619.534974 hartree
zpe.sumelectthermal: -619.519403 hartree
zpe.sumelectthermalent: -619.518459 hartree
zpe.sumelectthermalfe: -619.578095 hartree
dipole: -3.5681 2.6506 0.6448
dipole: 4.4914
quadrupole: -94.0130 -91.5157 -92.6380
quadrupole: 13.4416 3.4978 0.1843
quadrupole: -1.2908 1.2066 0.0842 13.4416 3.4978 0.1843
hfenergy: -619.8373414 hartree
pointgroup: C01 [X(C14H20O1)]
dipole: 1.4211438 1.0045284 -0.306216 debye
polarizability: 261.1252165|-4.9269394|143.1001144|4.5132471|-5.9414975|111.5702529 unknown
InChI: InChI=1S/C14H20O/c1-10(15)5-4-6-13-11-7-8-12(9-11)14(13,2)3/h4-6,11-12H,7-9H2,1-3H3
charge 0 multiplicity 1
35 atoms
O  -4.20871 -1.309138 0.365217
C  3.143855 -0.248851 0.272022
C  2.148878 0.938005 -0.026926
C  1.09065 -1.217755 0.548851
C  2.389036 -1.026147 1.392756
C  3.102452 -1.303458 -0.876189
C  1.673729 -1.944702 -0.720424
C  0.787433 0.215929 0.131821
C  2.323176 1.582121 -1.427063
C  2.310617 2.061974 1.041051
C  -0.439073 0.788438 -0.097413
C  -1.71027 0.108829 0.049654
C  -2.943339 0.676404 -0.18061
C  -4.199597 -0.091052 -0.002443
C  -5.50145 0.657214 -0.283179
H  4.159052 0.10386 0.520439
H  0.262576 -1.761006 1.027474
H  2.231076 -0.453179 2.321311
H  2.871205 -1.987932 1.64441
H  3.893656 -2.059047 -0.719154
H  3.267197 -0.864002 -1.873754
H  1.034565 -1.794033 -1.607376
H  1.735088 -3.031541 -0.530239
H  3.365281 1.927375 -1.565608
H  2.076413 0.883667 -2.244531
H  1.661833 2.461847 -1.533012
H  3.289407 2.562759 0.915874
H  1.51865 2.824275 0.925561
H  2.251746 1.673777 2.072294
H  -0.475719 1.840236 -0.419623
H  -1.714469 -0.943543 0.368502
H  -3.025425 1.723608 -0.50379
H  -5.520122 1.025302 -1.326958
H  -5.58973 1.542744 0.37508
H  -6.362163 -0.008279 -0.116223
