program: Orca
programVersion: 5.0.2
elementType: Br Cl S P O O O C C C C C C C C C C C H H H H H H H H H H H H H H H
charge: 0
multiplicity: 1
keywords: wb97x-d3
keywords: def2-TZVPP
keywords: def2/J RIJCOSX
keywords: DEFGRID2
keywords: scfconv7
keywords: smallprint printgap noloewdin
keywords: NOSOSCF
formula: C11H15BrClO3PS
InChI: InChI=1/C11H15BrClO3PS/c1-3-7-18-17(14,15-4-2)16-11-6-5-9(12)8-10(11)13/h5-6,8H,3-4,7H2,1-2H3
33 atoms
Br 4.676018 1.75118 -0.161932
Cl 0.772298 -1.995499 -1.170763
S  -3.429538 -1.493613 0.849581
P  -2.012533 -0.09664 0.319165
O  -0.68256 -0.69435 1.048304
O  -2.377779 1.128634 1.278914
O  -1.832329 0.226311 -1.105664
C  -2.92885 -2.898572 -0.222214
C  -3.302178 -2.752133 -1.687336
C  -4.795877 -2.61268 -1.928541
C  0.52725 -0.129273 0.760453
C  -3.055925 2.285356 0.761624
C  1.319802 -0.647426 -0.256833
C  0.985221 0.946491 1.502784
C  -4.515041 2.017604 0.469479
C  2.561468 -0.095308 -0.530153
C  2.222942 1.508308 1.239915
C  2.999687 0.986258 0.217537
H  -3.439704 -3.752335 0.227151
H  -1.8598 -3.06261 -0.091755
H  -2.766651 -1.907274 -2.119727
H  -2.929712 -3.645857 -2.197288
H  -5.012741 -2.562561 -2.994781
H  -5.348546 -3.459837 -1.518991
H  -5.189652 -1.705862 -1.470084
H  -2.950558 3.040323 1.540121
H  -2.540732 2.64584 -0.130183
H  0.366427 1.337142 2.299067
H  -5.002769 2.949109 0.181225
H  -4.640139 1.3129 -0.352307
H  -5.031435 1.623845 1.344273
H  3.165828 -0.5081 -1.325494
H  2.569947 2.346712 1.826884
totalener: -4428.04418797 hartree
nucrepener: 2244.06067408 hartree
electener: -6672.10486205 hartree
twoeener: 3927.94058211 hartree
kineticenergy: 4419.47357501 hartree
xcener: -190.173698972474 hartree
chargesum: 0.0000000
charge: -0.018551 -0.059058 -0.150582 0.779139 -0.345094 -0.354368 -0.499272 -0.129160 -0.108686 -0.236388 0.221073 0.031305 0.039140 -0.168067 -0.256002 -0.075931 -0.077523 -0.070823 0.117154 0.120345 0.087761 0.067558 0.087500 0.071085 0.074248 0.091734 0.100494 0.136275 0.088786 0.093399 0.091584 0.122024 0.128900
qa: -0.0186 -0.0591 -0.1506 0.7791 -0.3451 -0.3544 -0.4993 -0.1292 -0.1087 -0.2364 0.2211 0.0313 0.0391 -0.1681 -0.2560 -0.0759 -0.0775 -0.0708 0.1172 0.1203 0.0878 0.0676 0.0875 0.0711 0.0742 0.0917 0.1005 0.1363 0.0888 0.0934 0.0916 0.1220 0.1289
va: 1.2327 1.2518 2.2827 5.5161 2.1101 2.1188 2.0878 3.8892 3.8672 3.9406 3.8788 3.8863 4.0165 4.0466 3.9191 3.9242 3.8915 4.0584 1.0045 1.0323 1.0311 1.0080 1.0073 1.0032 1.0152 0.9891 1.0036 1.0101 1.0135 1.0096 1.0024 1.0106 1.0009
dispcorr: -0.017497612 hartree
energy: -4428.061685582110
dipole: -80.82153 80.13203 -0.68950 -18.50633 18.69685 0.19052 -1.71211 2.19742 0.48530
magnitude: 0.86442 au
magnitude: 2.19718 debye
