program: Orca
programVersion: 5.0.2
elementType: Br Cl S P O O O C C C C C C C C C C C H H H H H H H H H H H H H H H
charge: 0
multiplicity: 1
keywords: wb97x-d3
keywords: def2-TZVPP
keywords: def2/J RIJCOSX
keywords: DEFGRID2
keywords: scfconv7
keywords: smallprint printgap noloewdin
keywords: NOSOSCF
formula: C11H15BrClO3PS
InChI: InChI=1/C11H15BrClO3PS/c1-3-7-18-17(14,15-4-2)16-11-6-5-9(12)8-10(11)13/h5-6,8H,3-4,7H2,1-2H3
33 atoms
Br 4.741785 1.129376 -0.202617
Cl 0.079634 0.487657 2.648845
S  -3.768442 -1.083978 0.405209
P  -2.127148 -0.33327 -0.594945
O  -0.890895 -0.910529 0.289437
O  -2.077699 1.200007 -0.168708
O  -2.059686 -0.637673 -2.035926
C  -4.038128 -2.629411 -0.538532
C  -2.987694 -3.705187 -0.316263
C  -2.781127 -4.085507 1.140668
C  0.372733 -0.41863 0.131236
C  -2.628643 2.23605 -0.995364
C  0.965294 0.247978 1.198124
C  1.085078 -0.602273 -1.042757
C  -4.127714 2.357486 -0.838389
C  2.268487 0.708346 1.102771
C  2.385838 -0.138353 -1.151874
C  2.970215 0.510197 -0.075452
H  -4.13031 -2.372527 -1.5924
H  -5.016528 -2.967353 -0.191511
H  -3.308717 -4.581736 -0.88664
H  -2.042472 -3.390717 -0.762859
H  -2.08475 -4.91878 1.227127
H  -2.374902 -3.254394 1.715713
H  -3.718332 -4.388737 1.610432
H  -2.131847 3.148399 -0.667928
H  -2.356234 2.061163 -2.037714
H  0.620685 -1.11703 -1.87281
H  -4.407542 2.49009 0.206123
H  -4.480089 3.226676 -1.394387
H  -4.650376 1.482455 -1.222789
H  2.716848 1.218541 1.943593
H  2.932327 -0.288512 -2.072352
totalener: -4428.04581750 hartree
nucrepener: 2239.63162771 hartree
electener: -6667.67744521 hartree
twoeener: 3923.49742957 hartree
kineticenergy: 4419.47505464 hartree
xcener: -190.175092308328 hartree
chargesum: -0.0000000
charge: -0.019697 -0.047157 -0.146975 0.775487 -0.333021 -0.333465 -0.516567 -0.123846 -0.114814 -0.239258 0.222630 0.024221 -0.028660 -0.148719 -0.248159 -0.055187 -0.075123 -0.075200 0.129507 0.113393 0.075552 0.071179 0.086215 0.086408 0.073454 0.094071 0.098265 0.139979 0.091713 0.087321 0.087562 0.118713 0.130175
qa: -0.0197 -0.0472 -0.1470 0.7755 -0.3330 -0.3335 -0.5166 -0.1238 -0.1148 -0.2393 0.2226 0.0242 -0.0287 -0.1487 -0.2482 -0.0552 -0.0751 -0.0752 0.1295 0.1134 0.0756 0.0712 0.0862 0.0864 0.0735 0.0941 0.0983 0.1400 0.0917 0.0873 0.0876 0.1187 0.1302
va: 1.2319 1.2663 2.2875 5.5003 2.1050 2.1366 2.0908 3.8975 3.8802 3.9309 3.8485 3.8980 4.0557 4.0271 3.9107 3.8955 3.8922 4.0464 1.0244 1.0026 1.0087 1.0222 1.0070 1.0154 1.0035 0.9893 1.0055 1.0182 1.0028 1.0132 1.0143 1.0143 1.0008
dispcorr: -0.017021110 hartree
energy: -4428.062838614136
dipole: -74.51339 73.77126 -0.74214 -23.46597 23.47927 0.01330 -6.94026 6.73778 -0.20248
magnitude: 0.76938 au
magnitude: 1.95560 debye
