program: Orca
programVersion: 5.0.2
elementType: Br Cl S P O O O C C C C C C C C C C C H H H H H H H H H H H H H H H
charge: 0
multiplicity: 1
keywords: wb97x-d3
keywords: def2-TZVPP
keywords: def2/J RIJCOSX
keywords: DEFGRID2
keywords: scfconv7
keywords: smallprint printgap noloewdin
keywords: NOSOSCF
formula: C11H15BrClO3PS
InChI: InChI=1/C11H15BrClO3PS/c1-3-7-18-17(14,15-4-2)16-11-6-5-9(12)8-10(11)13/h5-6,8H,3-4,7H2,1-2H3
33 atoms
Br 4.426249 -0.790847 -0.255629
Cl 0.254275 2.79171 -0.431223
S  -3.056654 -1.539554 0.635966
P  -2.445872 0.360883 0.082003
O  -1.220996 0.746538 1.102636
O  -3.590516 1.25112 0.723294
O  -2.096917 0.505914 -1.340617
C  -2.787313 -2.432804 -0.942213
C  -1.359668 -2.904074 -1.151981
C  -0.897357 -3.928641 -0.129098
C  0.054871 0.394993 0.785988
C  -3.493212 2.687022 0.797774
C  0.864125 1.262753 0.060795
C  0.567811 -0.818785 1.212904
C  -3.708908 3.354191 -0.542108
C  2.170006 0.916193 -0.245003
C  1.870455 -1.179605 0.911932
C  2.660126 -0.310503 0.175601
H  -3.118971 -1.791629 -1.755909
H  -3.475428 -3.278619 -0.884284
H  -1.307938 -3.340377 -2.153885
H  -0.69044 -2.041649 -1.168075
H  -0.948965 -3.535129 0.886373
H  -1.514683 -4.827778 -0.161443
H  0.13303 -4.2298 -0.314994
H  -4.269546 2.978451 1.504057
H  -2.531118 2.973711 1.22719
H  -0.064168 -1.48046 1.78992
H  -4.662938 3.06318 -0.979672
H  -3.7186 4.435931 -0.403294
H  -2.918117 3.112733 -1.249936
H  2.786279 1.600816 -0.810541
H  2.25691 -2.130898 1.249414
totalener: -4428.04477203 hartree
nucrepener: 2287.25324458 hartree
electener: -6715.29801661 hartree
twoeener: 3970.95142423 hartree
kineticenergy: 4419.46878938 hartree
xcener: -190.175203500831 hartree
chargesum: -0.0000000
charge: -0.017716 -0.056374 -0.159527 0.768857 -0.356663 -0.319845 -0.500590 -0.101996 -0.124724 -0.253564 0.238635 -0.001664 0.061548 -0.226503 -0.225449 -0.086408 -0.069298 -0.059613 0.128868 0.112217 0.078432 0.079510 0.063404 0.086687 0.093792 0.100258 0.094609 0.143910 0.089097 0.081850 0.088866 0.120793 0.128604
qa: -0.0177 -0.0564 -0.1595 0.7689 -0.3567 -0.3198 -0.5006 -0.1020 -0.1247 -0.2536 0.2386 -0.0017 0.0615 -0.2265 -0.2254 -0.0864 -0.0693 -0.0596 0.1289 0.1122 0.0784 0.0795 0.0634 0.0867 0.0938 0.1003 0.0946 0.1439 0.0891 0.0818 0.0889 0.1208 0.1286
va: 1.2340 1.2546 2.2883 5.5174 2.0858 2.1620 2.0889 3.8612 3.8976 3.9109 3.8292 3.9071 3.9994 4.0145 3.8999 3.9415 3.8864 4.0588 1.0301 1.0071 1.0100 1.0186 1.0172 1.0083 1.0057 0.9915 1.0077 1.0010 1.0076 1.0088 1.0227 1.0118 1.0022
dispcorr: -0.019111819 hartree
energy: -4428.063883852779
dipole: -61.86260 61.52891 -0.33370 -4.56716 4.29936 -0.26780 -0.17820 0.55199 0.37379
magnitude: 0.56815 au
magnitude: 1.44412 debye
