program: Orca
programVersion: 5.0.2
elementType: Br Cl S P O O O C C C C C C C C C C C H H H H H H H H H H H H H H H
charge: 0
multiplicity: 1
keywords: wb97x-d3
keywords: def2-TZVPP
keywords: def2/J RIJCOSX
keywords: DEFGRID2
keywords: scfconv7
keywords: smallprint printgap noloewdin
keywords: NOSOSCF
formula: C11H15BrClO3PS
InChI: InChI=1/C11H15BrClO3PS/c1-3-7-18-17(14,15-4-2)16-11-6-5-9(12)8-10(11)13/h5-6,8H,3-4,7H2,1-2H3
33 atoms
Br 4.877195 0.067671 -0.333498
Cl 0.067357 2.735227 -0.413197
S  -2.30192 -2.104281 0.950106
P  -2.105404 -0.174597 0.223359
O  -0.928939 0.459964 1.165031
O  -3.360814 0.565943 0.854471
O  -1.844492 -0.067849 -1.221499
C  -2.530636 -3.054984 -0.600644
C  -3.986926 -3.311009 -0.951371
C  -4.787413 -2.058886 -1.271458
C  0.378037 0.346974 0.798402
C  -3.573895 1.981519 0.699343
C  0.982375 1.360409 0.06388
C  1.125488 -0.752511 1.187051
C  -4.070838 2.344009 -0.681757
C  2.324182 1.283466 -0.270884
C  2.466839 -0.84461 0.855187
C  3.056194 0.17546 0.12486
H  -2.007959 -3.994363 -0.418331
H  -2.00556 -2.535704 -1.40118
H  -3.98913 -3.978979 -1.818219
H  -4.465986 -3.863686 -0.139911
H  -4.309327 -1.46997 -2.054375
H  -5.788816 -2.321437 -1.611743
H  -4.900026 -1.421698 -0.394507
H  -4.316566 2.231074 1.456047
H  -2.659127 2.525103 0.944087
H  0.649824 -1.537642 1.759304
H  -4.967138 1.780134 -0.938849
H  -4.324974 3.404285 -0.703804
H  -3.317375 2.160557 -1.445115
H  2.779969 2.081814 -0.839073
H  3.039326 -1.706864 1.166686
totalener: -4428.04502011 hartree
nucrepener: 2247.90581464 hartree
electener: -6675.95083476 hartree
twoeener: 3931.79551156 hartree
kineticenergy: 4419.46697300 hartree
xcener: -190.174064806648 hartree
chargesum: 0.0000000
charge: -0.019118 -0.060051 -0.164087 0.782998 -0.368766 -0.314940 -0.502245 -0.114442 -0.089317 -0.254243 0.221247 0.009499 0.046817 -0.164403 -0.235403 -0.078155 -0.083483 -0.069290 0.111796 0.121990 0.067226 0.063075 0.092862 0.089736 0.069200 0.100469 0.091744 0.132655 0.084317 0.084804 0.097263 0.121729 0.128517
qa: -0.0191 -0.0601 -0.1641 0.7830 -0.3688 -0.3149 -0.5022 -0.1144 -0.0893 -0.2542 0.2212 0.0095 0.0468 -0.1644 -0.2354 -0.0782 -0.0835 -0.0693 0.1118 0.1220 0.0672 0.0631 0.0929 0.0897 0.0692 0.1005 0.0917 0.1327 0.0843 0.0848 0.0973 0.1217 0.1285
va: 1.2325 1.2513 2.2882 5.5125 2.1168 2.1174 2.0840 3.8776 3.8943 3.9275 3.8769 3.8911 4.0084 4.0569 3.9055 3.9249 3.9260 4.0591 1.0061 1.0317 1.0094 1.0123 1.0086 1.0076 1.0200 0.9916 1.0111 1.0128 1.0056 1.0106 1.0201 1.0108 1.0016
dispcorr: -0.017826937 hartree
energy: -4428.062847050889
dipole: -81.66428 81.01951 -0.64477 -12.22062 11.86538 -0.35524 -2.61735 2.92612 0.30877
magnitude: 0.79828 au
magnitude: 2.02907 debye
