program: Gaussian 09
title: 000005954
version: EM64L-G09RevD.01
frameworkgroup: C1[X(C18H12)]
method: RPBEPBE
basis: SDD
operation: Freq
keyword: #p
keyword: freq=noraman
keyword: PBEPBE/SDD
title: #p freq=noraman PBEPBE/SDD
converged: NO YES NO NO
title: Mulliken charges:
elementType: C C C C C C C C C C C C C C C C C C H H H H H H H H H H H H
charge: 0.242952 0.470674 0.196987 0.413015 0.403578 0.419789 -0.622256 -0.708291 -0.496470 -0.473570 -0.367863 -0.433361 -0.432459 -0.424834 -0.259957 -0.249354 -0.245324 -0.242427 0.229372 0.245810 0.240221 0.234163 0.223490 0.239297 0.241501 0.241596 0.227667 0.229434 0.228328 0.228292
chargesum: 0.00000
title: Mulliken charges with hydrogens summed into heavy atoms:
elementType: C C C C C C C C C C C C C C C C C C
charge: 0.242952 0.470674 0.196987 0.413015 0.403578 0.419789 -0.392884 -0.462481 -0.256249 -0.239407 -0.144373 -0.194064 -0.190957 -0.183239 -0.032290 -0.019920 -0.016997 -0.014134
polarizability: 3.81918885e+02 -1.26723917e-01 2.06797626e+02 9.73602927e-04 1.90387113e-03 7.21792223e+01
1716.lowfreq: -0.0009 -0.0003 0.0010 7.3770 8.7966 18.1526 68.8056 74.4047 147.8465
frequency: 68.7722 74.3911 147.8464 161.1072 187.7589 271.0704 291.0007 299.2861 349.9837 394.7145 423.7435 441.7694 471.4823 486.1696 519.1448 526.6818 545.3574 572.2418 579.4824 620.2707 646.2866 705.9745 714.6701 751.8018 755.7013 762.3662 781.9536 784.1407 804.4026 828.4667 862.4840 868.2037 886.7633 897.8568 905.9665 935.2590 957.0635 967.5323 976.0365 984.1262 990.3304 992.8049 1017.8096 1041.0965 1098.1189 1132.1906 1156.8386 1172.3291 1178.1555 1194.0197 1216.7908 1232.9282 1248.8148 1281.5864 1289.5208 1303.9281 1330.1702 1389.3841 1397.7925 1415.5234 1426.3201 1437.4957 1445.5993 1456.5269 1482.8654 1504.7603 1557.2243 1569.1030 1595.0875 1617.6208 1628.2770 1639.3105 3114.8600 3117.1811 3118.0348 3120.6661 3123.2211 3130.3283 3135.8746 3141.3810 3141.8431 3149.7530 3160.8405 3164.7431
redmass: 4.8303 3.9236 4.3305 4.9994 4.1936 3.9204 4.1421 5.5862 5.7053 3.2085 3.0036 4.8603 2.4618 5.8740 3.3917 6.8884 3.1634 6.7924 3.0919 6.6760 6.2311 3.1582 6.1464 1.2191 5.7348 1.3267 2.6059 4.8225 1.9758 1.4105 1.5144 4.0304 1.6387 5.8912 1.6120 2.0498 1.4042 1.4094 5.0807 1.3728 1.3478 1.3947 2.2687 2.1855 2.2770 1.6694 1.3235 1.0843 1.0824 1.3249 1.6870 1.8051 1.8262 2.1193 1.5693 2.3003 2.3507 4.6178 2.7073 3.0714 2.5952 4.2321 3.5661 2.8854 2.9123 3.5440 5.3946 7.4931 5.6022 6.1348 6.7821 6.8475 1.0889 1.0877 1.0865 1.0866 1.0888 1.0890 1.0899 1.0951 1.0982 1.0928 1.1003 1.0999
irintensity: 0.9386 0.0023 0.6933 0.3242 1.5472 1.1589 0.5523 0.7279 0.2154 0.0000 5.1414 2.0474 18.7370 0.0276 1.3586 0.6021 7.5619 5.6266 2.6380 1.9263 3.3172 6.1017 0.3146 3.6903 0.8118 122.8932 1.6653 0.5273 2.0238 26.0503 1.3780 2.8541 0.4520 0.1139 76.7796 3.2777 4.4757 15.9538 0.1655 0.5069 0.0724 0.0843 5.7994 7.9837 2.1122 7.0127 3.3623 0.4072 0.6698 6.4246 0.4338 3.4678 15.1499 0.1431 2.9197 0.4856 1.0523 3.2454 1.7561 3.1318 1.4047 0.6698 1.8496 3.9575 4.2514 21.0047 4.4284 0.0997 0.1036 0.9425 1.1725 0.6601 3.2337 3.2445 8.2384 4.5832 1.6204 6.4763 1.6073 18.9333 49.6839 32.4642 51.2471 35.5799
temp: 298.150 k
press: 1.00000 atm
elementType: 6 6 6 6 6 6 6 6 6 6 6 6 6 6 6 6 6 6 1 1 1 1 1 1 1 1 1 1 1 1
symmnumber: 1
zpe: 623663.4 jmol-1
zpe.correction: 0.237541 hartree
zpe.thermalcorrener: 0.249807 hartree
zpe.thermalcorrenthalpy: 0.250751 hartree
zpe.thermalcorrgfe: 0.199128 hartree
zpe.sumelectzpe: -691.966657 hartree
zpe.sumelectthermal: -691.954391 hartree
zpe.sumelectthermalent: -691.953447 hartree
zpe.sumelectthermalfe: -692.005069 hartree
dipole: 0.0169 -0.0443 0.0000
dipole: 0.0474
quadrupole: -87.3266 -88.0806 -113.0827
quadrupole: -0.1087 0.0000 0.0004
quadrupole: 8.8367 8.0827 -16.9194 -0.1087 0.0000 0.0004
hfenergy: -692.2041974 hartree
pointgroup: C01 [X(C18H12)]
dipole: 0.0066526 0.0174198 -0.0000011 debye
polarizability: 381.918964|-0.0467254|206.7975464|-0.0009717|0.0019048|72.1792223 unknown
InChI: InChI=1S/C18H12/c1-2-7-15-12-18-16(11-14(15)6-1)10-9-13-5-3-4-8-17(13)18/h1-12H
charge 0 multiplicity 1
30 atoms
C  0.34804 0.068107 -0.000005
C  -0.063609 -1.331089 -0.000031
C  1.786144 0.387382 -0.000021
C  -2.042487 0.734693 0.000024
C  -2.44675 -0.663279 -0.000013
C  2.74674 -0.687747 -0.000026
C  -0.657054 1.057186 0.000033
C  -1.43613 -1.660026 -0.000033
C  0.946363 -2.371976 -0.000053
C  2.289271 -2.064796 -0.000039
C  2.279931 1.725376 -0.000034
C  4.14255 -0.390874 -0.000025
C  -3.061707 1.749965 0.000042
C  -3.849482 -0.982426 -0.000031
C  3.657117 1.998929 -0.000025
C  4.599896 0.934203 -0.000024
C  -4.412552 1.407062 0.000032
C  -4.810441 0.026676 -0.000004
H  -0.385757 2.118644 0.00006
H  -1.72865 -2.717914 -0.000063
H  0.613401 -3.416743 -0.000076
H  3.043185 -2.861121 -0.000039
H  1.579979 2.566856 -0.000041
H  4.857497 -1.222601 -0.000019
H  -2.757832 2.803852 0.000073
H  -4.151994 -2.036639 -0.000058
H  4.005779 3.03754 -0.000029
H  5.673778 1.150053 -0.000019
H  -5.179444 2.189464 0.000055
H  -5.876283 -0.227058 -0.000011
