program: Orca
programVersion: 5.0.2
elementType: Br Cl S P O O O C C C C C C C C C C C H H H H H H H H H H H H H H H
charge: 0
multiplicity: 1
keywords: wb97x-d3
keywords: def2-TZVPP
keywords: def2/J RIJCOSX
keywords: DEFGRID2
keywords: scfconv7
keywords: smallprint printgap noloewdin
keywords: NOSOSCF
formula: C11H15BrClO3PS
InChI: InChI=1/C11H15BrClO3PS/c1-3-7-18-17(14,15-4-2)16-11-6-5-9(12)8-10(11)13/h5-6,8H,3-4,7H2,1-2H3
33 atoms
Br 4.596308 -0.480733 0.284867
Cl -0.101577 1.885543 1.915701
S  -2.238768 -0.953696 0.875307
P  -2.334867 0.115649 -0.905346
O  -1.094525 1.154019 -0.702785
O  -3.55034 1.129856 -0.837524
O  -2.325258 -0.697124 -2.129052
C  -3.071051 -2.503263 0.360556
C  -2.131319 -3.502249 -0.289653
C  -2.857062 -4.799847 -0.61976
C  0.183688 0.73626 -0.499104
C  -3.824657 1.992224 0.274954
C  0.795874 1.052234 0.707546
C  0.890792 0.043559 -1.467709
C  -3.405272 3.413871 -0.015715
C  2.112618 0.697744 0.945475
C  2.206949 -0.322069 -1.239262
C  2.808573 0.007982 -0.034487
H  -3.911056 -2.263676 -0.291155
H  -3.488758 -2.901469 1.286926
H  -1.716534 -3.06443 -1.19721
H  -1.293075 -3.700158 0.381521
H  -3.681629 -4.628663 -1.313139
H  -2.181357 -5.516084 -1.086122
H  -3.267787 -5.270843 0.274919
H  -4.901251 1.930871 0.436276
H  -3.340866 1.620567 1.182227
H  0.408796 -0.20417 -2.403789
H  -2.325416 3.503603 -0.115038
H  -3.872643 3.786043 -0.926523
H  -3.720074 4.05593 0.807591
H  2.574746 0.954267 1.887986
H  2.752324 -0.860618 -2.000941
totalener: -4428.04631471 hartree
nucrepener: 2255.68437143 hartree
electener: -6683.73068614 hartree
twoeener: 3939.15707700 hartree
kineticenergy: 4419.46927722 hartree
xcener: -190.175440107488 hartree
chargesum: -0.0000000
charge: -0.017478 -0.059598 -0.190667 0.776750 -0.342010 -0.313593 -0.503968 -0.086208 -0.086044 -0.257229 0.194155 0.022167 0.018255 -0.163057 -0.225001 -0.061361 -0.060460 -0.078947 0.108384 0.111431 0.080518 0.060399 0.083079 0.088590 0.071594 0.099387 0.080970 0.143202 0.080456 0.090584 0.081154 0.123379 0.131165
qa: -0.0175 -0.0596 -0.1907 0.7768 -0.3420 -0.3136 -0.5040 -0.0862 -0.0860 -0.2572 0.1942 0.0222 0.0183 -0.1631 -0.2250 -0.0614 -0.0605 -0.0789 0.1084 0.1114 0.0805 0.0604 0.0831 0.0886 0.0716 0.0994 0.0810 0.1432 0.0805 0.0906 0.0812 0.1234 0.1312
va: 1.2335 1.2533 2.2862 5.5290 2.1106 2.1474 2.1187 3.8961 3.8810 3.9634 3.8689 3.8829 3.9789 4.0417 3.9201 3.9060 3.8871 4.0577 1.0225 1.0077 1.0291 1.0133 1.0024 1.0064 1.0027 0.9959 1.0112 1.0157 1.0216 1.0068 1.0095 1.0095 0.9995
dispcorr: -0.017279307 hartree
energy: -4428.063594018407
dipole: -70.48265 70.02950 -0.45315 -9.73646 9.71008 -0.02639 -7.41681 8.19321 0.77640
magnitude: 0.89935 au
magnitude: 2.28596 debye
