program: Orca
programVersion: 5.0.2
elementType: Br Cl S P O O O C C C C C C C C C C C H H H H H H H H H H H H H H H
charge: 0
multiplicity: 1
keywords: wb97x-d3
keywords: def2-TZVPP
keywords: def2/J RIJCOSX
keywords: DEFGRID2
keywords: scfconv7
keywords: smallprint printgap noloewdin
keywords: NOSOSCF
formula: C11H15BrClO3PS
InChI: InChI=1/C11H15BrClO3PS/c1-3-7-18-17(14,15-4-2)16-11-6-5-9(12)8-10(11)13/h5-6,8H,3-4,7H2,1-2H3
33 atoms
Br 4.861872 0.056725 -0.474298
Cl 0.106295 2.800545 -0.197766
S  -2.296209 -2.117059 0.859092
P  -2.08608 -0.153099 0.239905
O  -0.898596 0.416492 1.208067
O  -3.338993 0.563886 0.90142
O  -1.833618 0.024314 -1.19929
C  -2.682499 -2.907797 -0.749495
C  -4.084104 -2.63616 -1.267847
C  -5.192094 -3.093984 -0.334874
C  0.401394 0.315978 0.807849
C  -3.578192 1.974433 0.736786
C  1.005579 1.375742 0.141693
C  1.139987 -0.821859 1.087502
C  -4.165884 2.303104 -0.617461
C  2.33555 1.304134 -0.237718
C  2.470179 -0.907951 0.711815
C  3.058032 0.156823 0.047146
H  -2.542787 -3.971801 -0.548772
H  -1.925085 -2.602145 -1.468412
H  -4.186534 -1.573553 -1.494268
H  -4.172343 -3.153827 -2.227201
H  -6.170815 -2.920172 -0.78086
H  -5.114837 -4.160922 -0.118667
H  -5.161436 -2.558955 0.613761
H  -4.274888 2.22988 1.533808
H  -2.657928 2.534551 0.913091
H  0.666389 -1.644943 1.605523
H  -4.441116 3.357794 -0.643311
H  -3.456788 2.118186 -1.421575
H  -5.065634 1.718924 -0.807802
H  2.789197 2.137546 -0.755081
H  3.034825 -1.801872 0.936109
totalener: -4428.04529072 hartree
nucrepener: 2238.85613836 hartree
electener: -6666.90142908 hartree
twoeener: 3922.71546333 hartree
kineticenergy: 4419.47583198 hartree
xcener: -190.174544521723 hartree
chargesum: 0.0000000
charge: -0.018641 -0.061017 -0.168344 0.776353 -0.364762 -0.314433 -0.503200 -0.118769 -0.104738 -0.242120 0.219701 0.017511 0.046349 -0.158321 -0.241378 -0.076568 -0.085245 -0.068870 0.112428 0.130188 0.071287 0.071503 0.086515 0.071673 0.085331 0.099144 0.089408 0.132755 0.084210 0.101261 0.081795 0.120832 0.128163
qa: -0.0186 -0.0610 -0.1683 0.7764 -0.3648 -0.3144 -0.5032 -0.1188 -0.1047 -0.2421 0.2197 0.0175 0.0463 -0.1583 -0.2414 -0.0766 -0.0852 -0.0689 0.1124 0.1302 0.0713 0.0715 0.0865 0.0717 0.0853 0.0991 0.0894 0.1328 0.0842 0.1013 0.0818 0.1208 0.1282
va: 1.2330 1.2499 2.2798 5.5122 2.1135 2.1230 2.0831 3.8953 3.8873 3.9291 3.8854 3.8942 4.0096 4.0535 3.9032 3.9268 3.9282 4.0590 1.0039 1.0260 1.0232 1.0091 1.0067 1.0036 1.0126 0.9915 1.0118 1.0121 1.0108 1.0196 1.0062 1.0111 1.0018
dispcorr: -0.017212735 hartree
energy: -4428.062503455501
dipole: -83.50114 82.78584 -0.71530 -13.73888 13.39096 -0.34791 0.04186 0.20521 0.24707
magnitude: 0.83291 au
magnitude: 2.11710 debye
