program: Orca
programVersion: 5.0.2
elementType: Br Cl S P O O O C C C C C C C C C C C H H H H H H H H H H H H H H H
charge: 0
multiplicity: 1
keywords: wb97x-d3
keywords: def2-TZVPP
keywords: def2/J RIJCOSX
keywords: DEFGRID2
keywords: scfconv7
keywords: smallprint printgap noloewdin
keywords: NOSOSCF
formula: C11H15BrClO3PS
InChI: InChI=1/C11H15BrClO3PS/c1-3-7-18-17(14,15-4-2)16-11-6-5-9(12)8-10(11)13/h5-6,8H,3-4,7H2,1-2H3
33 atoms
Br 4.731919 1.357442 0.242935
Cl 0.527244 -1.462879 -1.906507
S  -3.725675 -1.132374 0.16206
P  -2.138555 0.180939 0.114918
O  -0.888806 -0.754181 0.586147
O  -2.388607 1.058472 1.428177
O  -1.89999 0.92546 -1.131315
C  -3.483261 -1.990614 -1.442709
C  -2.704093 -3.288711 -1.319839
C  -3.401819 -4.341676 -0.474595
C  0.375256 -0.242785 0.49429
C  -2.930923 2.385454 1.319372
C  1.158597 -0.514377 -0.621488
C  0.898682 0.520218 1.52516
C  -4.416936 2.379999 1.039365
C  2.458566 -0.040675 -0.700392
C  2.193876 1.004263 1.456776
C  2.965707 0.718542 0.341633
H  -3.01142 -1.292731 -2.134421
H  -4.493438 -2.175637 -1.811945
H  -2.55354 -3.671711 -2.333701
H  -1.710673 -3.083148 -0.920828
H  -4.392503 -4.576443 -0.868064
H  -2.827909 -5.267594 -0.454821
H  -3.522116 -4.008808 0.556718
H  -2.720166 2.852786 2.280679
H  -2.393099 2.941296 0.549123
H  0.285424 0.724724 2.392121
H  -4.641124 1.97206 0.053927
H  -4.961075 1.799288 1.783702
H  -4.793249 3.40282 1.067087
H  3.055638 -0.262976 -1.573489
H  2.590917 1.597582 2.268163
totalener: -4428.04444659 hartree
nucrepener: 2242.02845097 hartree
electener: -6670.07289756 hartree
twoeener: 3925.87145578 hartree
kineticenergy: 4419.47239277 hartree
xcener: -190.172933148035 hartree
chargesum: -0.0000000
charge: -0.018462 -0.057256 -0.155039 0.772441 -0.343867 -0.354056 -0.497797 -0.117169 -0.095236 -0.247215 0.220909 0.030881 0.043811 -0.164422 -0.252421 -0.080416 -0.080646 -0.066399 0.127638 0.115445 0.072236 0.053398 0.074039 0.086875 0.082801 0.090022 0.100862 0.136541 0.094472 0.089991 0.087723 0.121725 0.128591
qa: -0.0185 -0.0573 -0.1550 0.7724 -0.3439 -0.3541 -0.4978 -0.1172 -0.0952 -0.2472 0.2209 0.0309 0.0438 -0.1644 -0.2524 -0.0804 -0.0806 -0.0664 0.1276 0.1154 0.0722 0.0534 0.0740 0.0869 0.0828 0.0900 0.1009 0.1365 0.0945 0.0900 0.0877 0.1217 0.1286
va: 1.2331 1.2549 2.2849 5.5263 2.1019 2.1153 2.1023 3.8695 3.8767 3.9449 3.8648 3.8885 4.0185 4.0470 3.9151 3.9320 3.9002 4.0564 1.0317 1.0047 1.0083 1.0398 1.0033 1.0066 1.0137 0.9888 1.0042 1.0104 1.0138 1.0030 1.0130 1.0105 1.0010
dispcorr: -0.017338960 hartree
energy: -4428.061785550003
dipole: -76.62169 75.93781 -0.68388 -19.20914 19.22609 0.01694 1.04482 -0.47835 0.56646
magnitude: 0.88818 au
magnitude: 2.25758 debye
