program: Orca
programVersion: 5.0.2
elementType: Br Cl S P O O O C C C C C C C C C C C H H H H H H H H H H H H H H H
charge: 0
multiplicity: 1
keywords: wb97x-d3
keywords: def2-TZVPP
keywords: def2/J RIJCOSX
keywords: DEFGRID2
keywords: scfconv7
keywords: smallprint printgap noloewdin
keywords: NOSOSCF
formula: C11H15BrClO3PS
InChI: InChI=1/C11H15BrClO3PS/c1-3-7-18-17(14,15-4-2)16-11-6-5-9(12)8-10(11)13/h5-6,8H,3-4,7H2,1-2H3
33 atoms
Br 3.784092 -1.8100 0.201146
Cl -0.356603 1.316715 2.04938
S  -2.995921 -0.979932 0.695381
P  -2.804196 0.275428 -0.955616
O  -1.412434 1.080859 -0.646116
O  -3.836955 1.460212 -0.77161
O  -2.867978 -0.396981 -2.260377
C  -3.17626 -2.611693 -0.120257
C  -1.87023 -3.22717 -0.58986
C  -0.833291 -3.409104 0.506097
C  -0.246042 0.402173 -0.477961
C  -3.962708 2.234105 0.430381
C  0.379231 0.445652 0.763054
C  0.341724 -0.305913 -1.514619
C  -3.360014 3.6073 0.253256
C  1.58378 -0.205856 0.971094
C  1.54252 -0.967124 -1.317428
C  2.155774 -0.912038 -0.075576
H  -3.88975 -2.517276 -0.936124
H  -3.638121 -3.226285 0.655111
H  -2.120413 -4.199322 -1.025843
H  -1.463173 -2.628376 -1.40525
H  -0.515205 -2.451625 0.918528
H  -1.221151 -4.013405 1.3283
H  0.054957 -3.908929 0.120753
H  -5.031963 2.297379 0.632035
H  -3.504551 1.720541 1.280746
H  -0.14429 -0.335399 -2.480556
H  -2.282575 3.55617 0.109011
H  -3.8025 4.124584 -0.597139
H  -3.551922 4.203709 1.145576
H  2.055585 -0.16175 1.942542
H  1.990929 -1.516803 -2.132937
totalener: -4428.04553021 hartree
nucrepener: 2324.60736653 hartree
electener: -6752.65289675 hartree
twoeener: 4007.96149480 hartree
kineticenergy: 4419.46429557 hartree
xcener: -190.177294011914 hartree
chargesum: 0.0000000
charge: -0.014297 -0.056697 -0.196251 0.783170 -0.339557 -0.318143 -0.503828 -0.097600 -0.124569 -0.249092 0.205631 0.020254 0.019123 -0.204215 -0.227367 -0.058364 -0.049800 -0.083614 0.127369 0.115621 0.078622 0.083158 0.068532 0.087952 0.090718 0.102444 0.077629 0.154481 0.083093 0.091628 0.081308 0.121528 0.131134
qa: -0.0143 -0.0567 -0.1963 0.7832 -0.3396 -0.3181 -0.5038 -0.0976 -0.1246 -0.2491 0.2056 0.0203 0.0191 -0.2042 -0.2274 -0.0584 -0.0498 -0.0836 0.1274 0.1156 0.0786 0.0832 0.0685 0.0880 0.0907 0.1024 0.0776 0.1545 0.0831 0.0916 0.0813 0.1215 0.1311
va: 1.2347 1.2553 2.2628 5.5169 2.0964 2.1576 2.1170 3.8872 3.8750 3.9204 3.8219 3.8998 3.9777 3.9910 3.9180 3.8699 3.8354 4.0456 1.0254 1.0050 1.0122 1.0220 1.0143 1.0087 1.0058 0.9975 1.0019 1.0108 1.0208 1.0065 1.0097 1.0122 0.9999
dispcorr: -0.020548873 hartree
energy: -4428.066079087484
dipole: -56.61492 56.46445 -0.15047 7.42144 -7.49095 -0.06951 -4.31208 5.06318 0.75109
magnitude: 0.76916 au
magnitude: 1.95505 debye
