program: Orca
programVersion: 5.0.2
elementType: Br Cl S P O O O C C C C C C C C C C C H H H H H H H H H H H H H H H
charge: 0
multiplicity: 1
keywords: wb97x-d3
keywords: def2-TZVPP
keywords: def2/J RIJCOSX
keywords: DEFGRID2
keywords: scfconv7
keywords: smallprint printgap noloewdin
keywords: NOSOSCF
formula: C11H15BrClO3PS
InChI: InChI=1/C11H15BrClO3PS/c1-3-7-18-17(14,15-4-2)16-11-6-5-9(12)8-10(11)13/h5-6,8H,3-4,7H2,1-2H3
33 atoms
Br 4.338575 -1.359082 -0.145121
Cl 0.688234 2.602239 -1.262992
S  -2.75512 -0.940032 0.85297
P  -2.265704 0.960498 0.147625
O  -0.900078 1.387052 0.924003
O  -3.209647 1.954283 0.951189
O  -2.245637 1.036874 -1.321733
C  -2.608021 -1.91857 -0.690522
C  -1.190826 -2.342075 -1.032791
C  -0.585828 -3.31346 -0.03315
C  0.280393 0.758937 0.663282
C  -4.428425 2.446268 0.373361
C  1.123806 1.223469 -0.341953
C  0.672241 -0.320549 1.438158
C  -5.543194 1.425052 0.399029
C  2.336292 0.594554 -0.582616
C  1.88108 -0.954427 1.208291
C  2.70144 -0.496983 0.189567
H  -3.057743 -1.342269 -1.496007
H  -3.24142 -2.789318 -0.508835
H  -1.223339 -2.80886 -2.021659
H  -0.560404 -1.457428 -1.143869
H  -0.580113 -2.898263 0.974699
H  -1.146517 -4.249246 -0.002069
H  0.444632 -3.551571 -0.295043
H  -4.689008 3.314197 0.977764
H  -4.240173 2.791882 -0.644888
H  0.020025 -0.6633 2.229336
H  -6.468653 1.897869 0.06882
H  -5.34515 0.585514 -0.266304
H  -5.703192 1.034128 1.402948
H  2.978891 0.964925 -1.368973
H  2.170621 -1.797513 1.819317
totalener: -4428.04309945 hartree
nucrepener: 2292.06278309 hartree
electener: -6720.10588254 hartree
twoeener: 3975.83484525 hartree
kineticenergy: 4419.46956925 hartree
xcener: -190.176889525436 hartree
chargesum: 0.0000000
charge: -0.016558 -0.034002 -0.183166 0.762430 -0.324194 -0.324053 -0.500232 -0.108051 -0.097900 -0.255516 0.175520 0.023019 0.054412 -0.177664 -0.247191 -0.087479 -0.100746 -0.045690 0.129107 0.110258 0.079414 0.065907 0.066700 0.089815 0.093350 0.096162 0.099975 0.139190 0.089045 0.085233 0.091314 0.119424 0.132166
qa: -0.0166 -0.0340 -0.1832 0.7624 -0.3242 -0.3241 -0.5002 -0.1081 -0.0979 -0.2555 0.1755 0.0230 0.0544 -0.1777 -0.2472 -0.0875 -0.1007 -0.0457 0.1291 0.1103 0.0794 0.0659 0.0667 0.0898 0.0933 0.0962 0.1000 0.1392 0.0890 0.0852 0.0913 0.1194 0.1322
va: 1.2344 1.2774 2.2619 5.5354 2.1484 2.1470 2.0950 3.8795 3.8887 3.9237 3.8645 3.8955 3.9936 3.9476 3.9045 3.9467 3.8556 4.0204 1.0285 1.0049 1.0129 1.0249 1.0113 1.0080 1.0053 0.9901 1.0036 1.0065 1.0124 1.0100 1.0052 1.0158 1.0008
dispcorr: -0.019351870 hartree
energy: -4428.062451318788
dipole: -68.05157 67.17761 -0.87395 -1.98229 1.35916 -0.62313 2.61427 -2.25251 0.36176
magnitude: 1.13267 au
magnitude: 2.87903 debye
