program: Orca
programVersion: 5.0.2
elementType: Br Cl S P O O O C C C C C C C C C C C H H H H H H H H H H H H H H H
charge: 0
multiplicity: 1
keywords: wb97x-d3
keywords: def2-TZVPP
keywords: def2/J RIJCOSX
keywords: DEFGRID2
keywords: scfconv7
keywords: smallprint printgap noloewdin
keywords: NOSOSCF
formula: C11H15BrClO3PS
InChI: InChI=1/C11H15BrClO3PS/c1-3-7-18-17(14,15-4-2)16-11-6-5-9(12)8-10(11)13/h5-6,8H,3-4,7H2,1-2H3
33 atoms
Br 4.766241 -0.511924 0.206463
Cl 0.058613 1.812103 1.863663
S  -2.100825 -1.042613 0.967422
P  -2.160925 -0.102199 -0.889955
O  -0.969857 1.004219 -0.736611
O  -3.407585 0.872867 -0.936025
O  -2.059795 -1.003638 -2.045879
C  -2.360842 -2.79676 0.502572
C  -3.802947 -3.261198 0.61046
C  -4.745351 -2.625718 -0.39801
C  0.321775 0.622685 -0.538174
C  -3.74627 1.787058 0.117489
C  0.945343 0.968454 0.655039
C  1.031715 -0.07089 -1.505519
C  -5.028875 1.359339 0.79034
C  2.271829 0.64025 0.879882
C  2.356921 -0.410203 -1.2901
C  2.967537 -0.0531 -0.097796
H  -1.724991 -3.348008 1.195782
H  -1.96227 -2.945605 -0.500004
H  -3.796077 -4.346177 0.467653
H  -4.165914 -3.092271 1.626998
H  -5.742843 -3.056244 -0.315541
H  -4.843148 -1.552038 -0.239357
H  -4.396212 -2.775351 -1.419337
H  -2.936647 1.868997 0.847221
H  -3.854779 2.764853 -0.352133
H  0.544041 -0.340948 -2.432203
H  -5.839573 1.258211 0.069661
H  -4.903549 0.410825 1.311305
H  -5.323211 2.109694 1.524614
H  2.742181 0.920259 1.811782
H  2.901407 -0.950629 -2.051397
totalener: -4428.04585522 hartree
nucrepener: 2260.73957157 hartree
electener: -6688.78542679 hartree
twoeener: 3944.27714920 hartree
kineticenergy: 4419.46188862 hartree
xcener: -190.175860077611 hartree
chargesum: 0.0000000
charge: -0.018593 -0.060149 -0.193539 0.792182 -0.342886 -0.313770 -0.507279 -0.094989 -0.099423 -0.239525 0.191684 0.020674 0.015331 -0.143311 -0.228376 -0.065265 -0.076532 -0.074009 0.115029 0.118600 0.069628 0.062921 0.088827 0.052018 0.099419 0.075608 0.098936 0.142445 0.098247 0.070202 0.092839 0.122133 0.130922
qa: -0.0186 -0.0601 -0.1935 0.7922 -0.3429 -0.3138 -0.5073 -0.0950 -0.0994 -0.2395 0.1917 0.0207 0.0153 -0.1433 -0.2284 -0.0653 -0.0765 -0.0740 0.1150 0.1186 0.0696 0.0629 0.0888 0.0520 0.0994 0.0756 0.0989 0.1424 0.0982 0.0702 0.0928 0.1221 0.1309
va: 1.2326 1.2509 2.2766 5.5064 2.1190 2.1300 2.1184 3.8911 3.8917 3.9322 3.8854 3.9087 3.9836 4.0351 3.8994 3.9136 3.9011 4.0521 1.0049 1.0315 1.0098 1.0104 1.0079 1.0158 1.0113 1.0056 0.9968 1.0164 1.0022 1.0170 1.0134 1.0108 1.0001
dispcorr: -0.018108709 hartree
energy: -4428.063963929632
dipole: -82.95419 82.34905 -0.60513 -9.40820 9.33316 -0.07503 -2.42712 3.22055 0.79343
magnitude: 1.00067 au
magnitude: 2.54351 debye
