program: Orca
programVersion: 5.0.2
elementType: Br Cl S P O O O C C C C C C C C C C C H H H H H H H H H H H H H H H
charge: 0
multiplicity: 1
keywords: wb97x-d3
keywords: def2-TZVPP
keywords: def2/J RIJCOSX
keywords: DEFGRID2
keywords: scfconv7
keywords: smallprint printgap noloewdin
keywords: NOSOSCF
formula: C11H15BrClO3PS
InChI: InChI=1/C11H15BrClO3PS/c1-3-7-18-17(14,15-4-2)16-11-6-5-9(12)8-10(11)13/h5-6,8H,3-4,7H2,1-2H3
33 atoms
Br 4.934764 0.368243 -0.012639
Cl -0.007756 2.715065 -0.611349
S  -2.172626 -2.209809 0.566423
P  -2.073688 -0.268228 -0.134953
O  -1.002865 0.394321 0.90694
O  -3.424634 0.390895 0.38462
O  -1.745179 -0.116273 -1.560662
C  -2.733491 -3.055606 -0.957932
C  -4.181101 -2.787097 -1.333149
C  -5.182905 -3.152663 -0.250591
C  0.335442 0.358267 0.652194
C  -3.775821 1.74115 0.023057
C  0.941811 1.402799 -0.036024
C  1.109276 -0.688855 1.123525
C  -3.479865 2.702261 1.150112
C  2.31245 1.409315 -0.239107
C  2.479429 -0.696092 0.925725
C  3.07183 0.356366 0.245722
H  -2.580931 -4.113195 -0.734353
H  -2.054168 -2.784816 -1.764237
H  -4.296095 -1.740068 -1.62009
H  -4.38564 -3.366862 -2.237745
H  -5.083198 -4.197612 0.048042
H  -5.048929 -2.538371 0.639058
H  -6.203771 -3.007589 -0.602805
H  -3.259955 2.035013 -0.89315
H  -4.843109 1.716135 -0.1950
H  0.632258 -1.499754 1.65729
H  -3.981418 2.401474 2.068566
H  -2.412211 2.777123 1.345702
H  -3.840987 3.69546 0.881198
H  2.769751 2.231236 -0.771495
H  3.072112 -1.517268 1.303116
totalener: -4428.04514675 hartree
nucrepener: 2237.94371981 hartree
electener: -6665.98886656 hartree
twoeener: 3921.78724769 hartree
kineticenergy: 4419.47502253 hartree
xcener: -190.173798456826 hartree
chargesum: -0.0000000
charge: -0.018612 -0.057338 -0.170552 0.770225 -0.368381 -0.317921 -0.495435 -0.123617 -0.109042 -0.240470 0.222337 0.013195 0.045248 -0.155950 -0.216167 -0.078386 -0.081743 -0.069446 0.111099 0.133802 0.071933 0.073166 0.072244 0.086053 0.086311 0.093766 0.098648 0.132245 0.087768 0.072416 0.082123 0.121896 0.128584
qa: -0.0186 -0.0573 -0.1706 0.7702 -0.3684 -0.3179 -0.4954 -0.1236 -0.1090 -0.2405 0.2223 0.0132 0.0452 -0.1559 -0.2162 -0.0784 -0.0817 -0.0694 0.1111 0.1338 0.0719 0.0732 0.0722 0.0861 0.0863 0.0938 0.0986 0.1322 0.0878 0.0724 0.0821 0.1219 0.1286
va: 1.2328 1.2553 2.2814 5.5323 2.1083 2.1070 2.1088 3.9019 3.8793 3.9292 3.8631 3.8946 4.0170 4.0745 3.9240 3.9238 3.9292 4.0612 1.0033 1.0245 1.0229 1.0092 1.0038 1.0132 1.0068 1.0061 0.9913 1.0074 1.0075 1.0284 1.0100 1.0103 1.0019
dispcorr: -0.017340685 hartree
energy: -4428.062487431100
dipole: -83.00406 82.19927 -0.80479 -16.17196 15.81470 -0.35725 0.20424 0.15209 0.35633
magnitude: 0.94989 au
magnitude: 2.41443 debye
