program: Orca
programVersion: 5.0.2
elementType: Br Cl S P O O O C C C C C C C C C C C H H H H H H H H H H H H H H H
charge: 0
multiplicity: 1
keywords: wb97x-d3
keywords: def2-TZVPP
keywords: def2/J RIJCOSX
keywords: DEFGRID2
keywords: scfconv7
keywords: smallprint printgap noloewdin
keywords: NOSOSCF
formula: C11H15BrClO3PS
InChI: InChI=1/C11H15BrClO3PS/c1-3-7-18-17(14,15-4-2)16-11-6-5-9(12)8-10(11)13/h5-6,8H,3-4,7H2,1-2H3
33 atoms
Br 4.271176 -0.996623 0.322651
Cl -0.287105 1.461503 2.200179
S  -2.56633 -0.755794 0.525094
P  -2.381147 0.591567 -1.052671
O  -1.1109 1.51016 -0.588753
O  -3.543934 1.659599 -0.936623
O  -2.260033 -0.02208 -2.382164
C  -2.826955 -2.340657 -0.364703
C  -1.706823 -3.330549 -0.084285
C  -0.343095 -2.882919 -0.583386
C  0.113679 0.942767 -0.409492
C  -3.976838 2.289197 0.275953
C  0.631753 0.858499 0.877655
C  0.855322 0.467653 -1.479044
C  -3.318748 3.633763 0.483525
C  1.875488 0.291145 1.101912
C  2.100348 -0.100476 -1.268556
C  2.597131 -0.193846 0.022249
H  -2.908651 -2.129495 -1.42974
H  -3.785935 -2.727067 -0.02131
H  -1.661752 -3.546419 0.985894
H  -1.989464 -4.269475 -0.569977
H  -0.375627 -2.616113 -1.640353
H  0.016927 -2.01402 -0.033975
H  0.394385 -3.675447 -0.459442
H  -5.055515 2.40123 0.169384
H  -3.805439 1.63089 1.13228
H  0.449141 0.536794 -2.478813
H  -3.460286 4.278772 -0.382397
H  -3.776127 4.123801 1.34336
H  -2.252956 3.542167 0.679347
H  2.260994 0.226146 2.109535
H  2.668183 -0.474233 -2.108754
totalener: -4428.04429854 hartree
nucrepener: 2315.60388891 hartree
electener: -6743.64818745 hartree
twoeener: 3999.11680733 hartree
kineticenergy: 4419.46819150 hartree
xcener: -190.179073082127 hartree
chargesum: -0.0000000
charge: -0.015751 -0.057999 -0.205789 0.796423 -0.343616 -0.315174 -0.507457 -0.101783 -0.091990 -0.239307 0.185317 0.015700 0.028522 -0.141194 -0.219948 -0.070868 -0.081518 -0.065350 0.120759 0.116875 0.066434 0.070214 0.087754 0.051874 0.095077 0.099403 0.083714 0.138683 0.089922 0.082062 0.077220 0.121860 0.129931
qa: -0.0158 -0.0580 -0.2058 0.7964 -0.3436 -0.3152 -0.5075 -0.1018 -0.0920 -0.2393 0.1853 0.0157 0.0285 -0.1412 -0.2199 -0.0709 -0.0815 -0.0653 0.1208 0.1169 0.0664 0.0702 0.0878 0.0519 0.0951 0.0994 0.0837 0.1387 0.0899 0.0821 0.0772 0.1219 0.1299
va: 1.2338 1.2527 2.2711 5.5191 2.1005 2.1667 2.1181 3.8809 3.8981 3.9411 3.8623 3.9007 3.9754 3.9788 3.9155 3.9136 3.8699 4.0320 1.0365 1.0083 1.0099 1.0111 1.0044 1.0166 1.0094 0.9935 1.0042 1.0167 1.0077 1.0104 1.0249 1.0117 1.0011
dispcorr: -0.019778386 hartree
energy: -4428.064076925298
dipole: -58.96712 58.58418 -0.38294 2.35923 -2.50309 -0.14385 -7.65767 8.39699 0.73932
magnitude: 0.84495 au
magnitude: 2.14769 debye
