program: Orca
programVersion: 5.0.2
elementType: Br Cl S P O O O C C C C C C C C C C C H H H H H H H H H H H H H H H
charge: 0
multiplicity: 1
keywords: wb97x-d3
keywords: def2-TZVPP
keywords: def2/J RIJCOSX
keywords: DEFGRID2
keywords: scfconv7
keywords: smallprint printgap noloewdin
keywords: NOSOSCF
formula: C11H15BrClO3PS
InChI: InChI=1/C11H15BrClO3PS/c1-3-7-18-17(14,15-4-2)16-11-6-5-9(12)8-10(11)13/h5-6,8H,3-4,7H2,1-2H3
33 atoms
Br 4.214345 -1.053696 0.276267
Cl -0.18648 1.646765 2.16857
S  -2.780195 -0.505408 0.64376
P  -2.389756 0.655271 -1.034987
O  -1.107326 1.59298 -0.622352
O  -3.517329 1.761228 -1.113443
O  -2.204006 -0.133674 -2.261101
C  -2.397176 -2.180029 0.013776
C  -0.922213 -2.532682 0.072344
C  -0.675965 -3.968546 -0.370684
C  0.106458 1.004246 -0.435748
C  -3.643499 2.955614 -0.331921
C  0.652831 0.948479 0.841666
C  0.812237 0.466594 -1.502196
C  -3.931079 2.691095 1.128761
C  1.881419 0.343842 1.057761
C  2.040068 -0.138938 -1.29886
C  2.560793 -0.207889 -0.016015
H  -2.794363 -2.270788 -0.995827
H  -2.981223 -2.839183 0.659311
H  -0.360713 -1.853807 -0.570628
H  -0.54991 -2.380965 1.08766
H  0.385946 -4.209448 -0.330889
H  -1.199395 -4.683212 0.266394
H  -1.011835 -4.129709 -1.395813
H  -2.747969 3.567758 -0.448726
H  -4.473531 3.490885 -0.791117
H  0.389999 0.516604 -2.495969
H  -3.080192 2.244527 1.642669
H  -4.147712 3.637747 1.624744
H  -4.795304 2.040246 1.255078
H  2.287342 0.3037 2.058659
H  2.574876 -0.560367 -2.138176
totalener: -4428.04387509 hartree
nucrepener: 2312.41254941 hartree
electener: -6740.45642450 hartree
twoeener: 3995.89373286 hartree
kineticenergy: 4419.46169778 hartree
xcener: -190.178138685923 hartree
chargesum: 0.0000000
charge: -0.014923 -0.053100 -0.184444 0.779413 -0.348818 -0.319923 -0.506317 -0.084014 -0.078735 -0.258164 0.166775 0.038627 0.033610 -0.113649 -0.263215 -0.090429 -0.088866 -0.062240 0.117739 0.111332 0.049467 0.067540 0.088663 0.077414 0.085192 0.091163 0.098439 0.138548 0.077547 0.091749 0.101166 0.121360 0.131090
qa: -0.0149 -0.0531 -0.1844 0.7794 -0.3488 -0.3199 -0.5063 -0.0840 -0.0787 -0.2582 0.1668 0.0386 0.0336 -0.1136 -0.2632 -0.0904 -0.0889 -0.0622 0.1177 0.1113 0.0495 0.0675 0.0887 0.0774 0.0852 0.0912 0.0984 0.1385 0.0775 0.0917 0.1012 0.1214 0.1311
va: 1.2348 1.2555 2.2780 5.5061 2.0745 2.1796 2.1153 3.9028 3.8916 3.9693 3.8895 3.8755 3.9755 3.9624 3.9139 3.9232 3.8852 4.0321 1.0279 1.0061 1.0249 1.0135 1.0059 1.0038 1.0017 0.9997 0.9864 1.0175 1.0135 1.0156 1.0049 1.0126 1.0015
dispcorr: -0.019583382 hartree
energy: -4428.063458475701
dipole: -57.82838 57.66643 -0.16195 0.26013 -0.02491 0.23522 -5.25475 5.91268 0.65793
magnitude: 0.71723 au
magnitude: 1.82306 debye
