program: Orca
programVersion: 5.0.2
elementType: Br Cl S P O O O C C C C C C C C C C C H H H H H H H H H H H H H H H
charge: 0
multiplicity: 1
keywords: wb97x-d3
keywords: def2-TZVPP
keywords: def2/J RIJCOSX
keywords: DEFGRID2
keywords: scfconv7
keywords: smallprint printgap noloewdin
keywords: NOSOSCF
formula: C11H15BrClO3PS
InChI: InChI=1/C11H15BrClO3PS/c1-3-7-18-17(14,15-4-2)16-11-6-5-9(12)8-10(11)13/h5-6,8H,3-4,7H2,1-2H3
33 atoms
Br 4.231076 -1.050822 0.432134
Cl -0.187145 1.700424 2.234927
S  -2.501868 -0.67642 0.631258
P  -2.38165 0.697511 -0.929035
O  -1.073158 1.597679 -0.532544
O  -3.521664 1.774774 -0.707194
O  -2.356704 0.106631 -2.273844
C  -2.525485 -2.254391 -0.303339
C  -1.161262 -2.716834 -0.782165
C  -0.139095 -2.903456 0.326318
C  0.131205 0.994715 -0.341058
C  -3.750291 2.454402 0.533493
C  0.679137 0.980945 0.936912
C  0.821592 0.404282 -1.387681
C  -5.058101 3.200318 0.425145
C  1.907686 0.385617 1.172241
C  2.047294 -0.2005 -1.163968
C  2.579924 -0.208873 0.115714
H  -3.226891 -2.158432 -1.129326
H  -2.948282 -2.962002 0.412304
H  -1.316053 -3.665669 -1.304911
H  -0.788063 -2.018997 -1.532033
H  0.070958 -1.964848 0.838411
H  -0.484476 -3.620409 1.073208
H  0.804129 -3.273575 -0.07405
H  -3.791426 1.730507 1.353127
H  -2.922959 3.138549 0.731398
H  0.393766 0.419496 -2.381211
H  -5.033643 3.927207 -0.385367
H  -5.889547 2.518949 0.252079
H  -5.249406 3.737393 1.353921
H  2.31683 0.380243 2.17283
H  2.574839 -0.661981 -1.98681
totalener: -4428.04621286 hartree
nucrepener: 2315.94921027 hartree
electener: -6743.99542313 hartree
twoeener: 3999.34556877 hartree
kineticenergy: 4419.46650708 hartree
xcener: -190.177798024216 hartree
chargesum: 0.0000000
charge: -0.014776 -0.056233 -0.201455 0.784127 -0.341204 -0.309986 -0.505428 -0.094642 -0.123079 -0.249966 0.198663 0.013477 0.020114 -0.189137 -0.228594 -0.060644 -0.055681 -0.083363 0.128000 0.115201 0.077970 0.083121 0.069396 0.088208 0.089844 0.090007 0.097575 0.154076 0.089979 0.086927 0.075868 0.120842 0.130792
qa: -0.0148 -0.0562 -0.2015 0.7841 -0.3412 -0.3100 -0.5054 -0.0946 -0.1231 -0.2500 0.1987 0.0135 0.0201 -0.1891 -0.2286 -0.0606 -0.0557 -0.0834 0.1280 0.1152 0.0780 0.0831 0.0694 0.0882 0.0898 0.0900 0.0976 0.1541 0.0900 0.0869 0.0759 0.1208 0.1308
va: 1.2336 1.2535 2.2658 5.5208 2.1015 2.1743 2.1178 3.8848 3.8733 3.9231 3.8423 3.8868 3.9854 3.9746 3.9761 3.8734 3.8293 4.0355 1.0255 1.0052 1.0124 1.0235 1.0129 1.0093 1.0056 0.9907 0.9952 1.0097 1.0062 1.0073 1.0065 1.0130 1.0002
dispcorr: -0.020053034 hartree
energy: -4428.066265891357
dipole: -60.76093 60.49658 -0.26435 2.52589 -2.67183 -0.14594 -7.11511 7.84882 0.73371
magnitude: 0.79342 au
magnitude: 2.01672 debye
