program: Orca
programVersion: 5.0.2
elementType: Br Cl S P O O O C C C C C C C C C C C H H H H H H H H H H H H H H H
charge: 0
multiplicity: 1
keywords: wb97x-d3
keywords: def2-TZVPP
keywords: def2/J RIJCOSX
keywords: DEFGRID2
keywords: scfconv7
keywords: smallprint printgap noloewdin
keywords: NOSOSCF
formula: C11H15BrClO3PS
InChI: InChI=1/C11H15BrClO3PS/c1-3-7-18-17(14,15-4-2)16-11-6-5-9(12)8-10(11)13/h5-6,8H,3-4,7H2,1-2H3
33 atoms
Br 4.538895 0.473771 1.385106
Cl 0.400728 2.235808 -1.788794
S  -2.557856 -1.564461 0.905314
P  -2.242837 -0.090758 -0.530546
O  -0.806585 -0.37513 -1.225304
O  -1.870492 1.160334 0.379604
O  -3.312151 0.004062 -1.531966
C  -3.56516 -2.741984 -0.063625
C  -2.767204 -3.555658 -1.066565
C  -3.641872 -4.594285 -1.756201
C  0.390224 -0.182505 -0.603899
C  -2.882174 1.893341 1.087922
C  1.081984 1.008004 -0.800844
C  0.951345 -1.177552 0.178634
C  -3.50695 2.959697 0.218089
C  2.322427 1.204129 -0.215908
C  2.189063 -0.991793 0.772156
C  2.86407 0.20185 0.573772
H  -4.368626 -2.187293 -0.546593
H  -4.015859 -3.389774 0.69086
H  -2.331435 -2.889633 -1.813757
H  -1.933726 -4.045131 -0.557554
H  -4.068361 -5.29799 -1.039599
H  -4.467118 -4.124552 -2.292388
H  -3.066453 -5.170323 -2.480152
H  -3.638754 1.207096 1.479596
H  -2.368965 2.33326 1.942304
H  0.411892 -2.103662 0.322647
H  -4.051134 2.524518 -0.618306
H  -4.207794 3.547791 0.811306
H  -2.7487 3.635375 -0.175775
H  2.848142 2.134349 -0.379205
H  2.615638 -1.775432 1.382046
totalener: -4428.04546310 hartree
nucrepener: 2241.23564758 hartree
electener: -6669.28111068 hartree
twoeener: 3924.83111804 hartree
kineticenergy: 4419.46845358 hartree
xcener: -190.174696813374 hartree
chargesum: 0.0000000
charge: -0.018725 -0.046181 -0.188916 0.757735 -0.330100 -0.315318 -0.497630 -0.083680 -0.103271 -0.252237 0.232550 0.015226 0.006250 -0.135725 -0.228978 -0.069156 -0.096094 -0.065920 0.118619 0.108739 0.079724 0.055775 0.073132 0.085901 0.088806 0.082168 0.095821 0.121372 0.096132 0.080680 0.084272 0.120394 0.128634
qa: -0.0187 -0.0462 -0.1889 0.7577 -0.3301 -0.3153 -0.4976 -0.0837 -0.1033 -0.2522 0.2326 0.0152 0.0063 -0.1357 -0.2290 -0.0692 -0.0961 -0.0659 0.1186 0.1087 0.0797 0.0558 0.0731 0.0859 0.0888 0.0822 0.0958 0.1214 0.0961 0.0807 0.0843 0.1204 0.1286
va: 1.2329 1.2689 2.2736 5.5252 2.1250 2.1149 2.1337 3.8714 3.8909 3.9671 3.8331 3.9020 4.0174 4.0225 3.9234 3.9106 3.9447 4.0492 1.0269 1.0060 1.0201 1.0124 1.0027 1.0029 1.0058 1.0077 0.9914 1.0175 1.0202 1.0103 1.0081 1.0135 1.0022
dispcorr: -0.016870303 hartree
energy: -4428.062333403202
dipole: -73.99875 73.65510 -0.34365 -21.82494 21.30682 -0.51812 -13.10801 14.07644 0.96843
magnitude: 1.15082 au
magnitude: 2.92516 debye
