program: Gaussian 09
title: 000066287
version: EM64L-G09RevD.01
frameworkgroup: C1[X(C14H12OS)]
method: RPBEPBE
basis: SDD
operation: Freq
keyword: #p
keyword: freq=noraman
keyword: PBEPBE/SDD
title: #p freq=noraman PBEPBE/SDD
converged: YES YES NO NO
title: Mulliken charges:
elementType: S O C C C C C C C C C C C C C C H H H H H H H H H H H H
charge: 0.243767 -0.232543 0.307714 -0.202038 -0.363343 -0.343099 -0.157225 -0.242265 -0.221123 0.121058 -0.227627 -0.231824 -0.213401 -0.211552 -0.789861 -0.225156 0.242364 0.280088 0.255938 0.245004 0.263455 0.262492 0.235652 0.235546 0.236579 0.236237 0.260427 0.234737
chargesum: 0.00000
title: Mulliken charges with hydrogens summed into heavy atoms:
elementType: S O C C C C C C C C C C C C C C
charge: 0.243767 -0.232543 0.307714 -0.202038 -0.120980 -0.063012 0.098713 0.002740 -0.221123 0.121058 0.035828 0.030668 0.022251 0.023995 -0.056618 0.009580
polarizability: 2.65594566e+02 1.36653959e+01 1.58599313e+02 2.15593378e+00 -4.43127163e-01 1.11721653e+02
1716.lowfreq: -4.6472 -2.6725 -0.0013 -0.0007 0.0022 4.7796 11.8402 30.8798 49.5181
frequency: 11.1382 30.7356 49.5133 71.1938 80.1833 140.2928 148.2349 203.4154 242.6272 258.7803 268.9300 327.3905 403.1893 404.1970 405.3090 437.7721 464.4903 490.9098 519.9841 588.5548 598.6017 610.1228 625.7018 679.8233 696.4501 727.8583 741.3375 758.7643 833.4010 851.1442 853.7122 929.7050 944.8452 967.7166 980.5786 985.2077 994.6475 1000.0952 1000.6803 1014.6214 1026.7685 1055.9151 1071.1749 1073.0059 1083.3714 1121.0389 1173.3010 1182.0608 1191.8201 1278.7320 1299.8901 1300.5344 1359.1230 1370.2627 1373.2422 1410.8870 1425.7968 1446.3123 1459.0385 1463.2663 1476.9949 1553.4201 1585.0380 1587.1815 1589.7928 1607.3874 2984.1987 3068.4284 3124.2984 3131.4519 3135.9030 3140.7647 3141.7874 3153.4593 3159.9425 3162.5878 3163.5398 3172.5904
redmass: 4.6663 3.8144 5.5392 3.6660 7.9162 1.0366 5.2815 5.4043 5.7270 4.4356 6.0623 7.5119 4.3276 3.2184 2.9016 4.6797 3.2799 5.2250 5.0038 2.4588 4.3993 6.4744 7.1505 6.7113 2.2009 3.6067 5.2996 1.5773 1.3786 1.3142 1.2508 1.3679 2.1877 1.3437 1.3877 6.3867 1.3580 2.9038 1.4689 3.3667 1.8213 4.0403 1.6011 2.2688 2.3225 1.3549 1.0545 1.1137 1.1402 3.5609 1.2996 1.3028 2.6248 1.5761 9.7907 4.3644 2.0744 1.1009 2.0998 1.0498 2.3239 6.7205 6.2967 6.3155 6.6138 6.8284 1.0374 1.0970 1.0990 1.0852 1.0887 1.0873 1.0887 1.0931 1.0952 1.0969 1.0965 1.1015
irintensity: 0.3349 0.8023 0.0630 3.2010 1.6886 0.4395 3.9891 0.2843 0.2663 4.3993 0.2476 0.9868 2.3392 0.5765 0.1359 0.9642 9.1555 29.1446 6.4993 12.0152 6.8612 0.2504 1.0611 6.1097 46.1930 1.7197 7.2765 71.8726 34.2345 24.1919 1.7076 1.6034 52.6730 1.2923 0.1079 12.7802 1.2733 20.2161 5.4383 17.0131 0.8991 39.4386 7.8434 6.9278 17.7048 10.4703 0.0014 5.1988 28.3907 279.9153 2.9542 1.9545 4.0927 69.9871 1.6489 23.3826 11.0475 37.6679 29.5831 20.4688 6.6952 133.6794 166.7996 1.5155 128.4461 43.1151 3.8843 13.4907 20.2123 0.1652 3.8992 3.9219 5.6946 17.3199 9.9155 17.4348 0.2160 16.3458
temp: 298.150 k
press: 1.00000 atm
elementType: 16 8 6 6 6 6 6 6 6 6 6 6 6 6 6 6 1 1 1 1 1 1 1 1 1 1 1 1
symmnumber: 1
zpe: 564913.5 jmol-1
zpe.correction: 0.215164 hartree
zpe.thermalcorrener: 0.229804 hartree
zpe.thermalcorrenthalpy: 0.230748 hartree
zpe.thermalcorrgfe: 0.170425 hartree
zpe.sumelectzpe: -1012.853111 hartree
zpe.sumelectthermal: -1012.838472 hartree
zpe.sumelectthermalent: -1012.837528 hartree
zpe.sumelectthermalfe: -1012.897850 hartree
dipole: -4.5654 -3.1798 -0.0663
dipole: 5.5640
quadrupole: -114.8185 -93.2372 -96.9556
quadrupole: 1.3186 0.1786 -0.1572
quadrupole: -13.1481 8.4332 4.7148 1.3186 0.1786 -0.1572
hfenergy: -1013.0682755 hartree
pointgroup: C01 [X(C14H12O1S1)]
dipole: 1.7769795 1.2632278 -0.1964627 debye
polarizability: 264.8031179|16.4894257|157.2247125|4.5707546|-9.0228103|113.8877021 unknown
InChI: InChI=1S/C14H12OS/c1-11(15)12-7-9-14(10-8-12)16-13-5-3-2-4-6-13/h2-10H,1H3
charge 0 multiplicity 1
28 atoms
S  1.419472 -1.903155 0.553948
O  -5.223658 -0.365804 -0.247616
C  -2.83284 -0.088648 -0.174161
C  -0.219899 -1.125634 0.253587
C  -1.688021 0.739478 -0.319824
C  -2.641782 -1.451686 0.190506
C  -0.390288 0.230744 -0.10993
C  -1.354324 -1.968842 0.403362
C  2.590829 -0.496022 0.31026
C  -4.230172 0.409957 -0.388056
C  2.922721 0.337746 1.403253
C  3.201875 -0.30909 -0.950963
C  3.869398 1.373775 1.227132
C  4.150171 0.727197 -1.119699
C  -4.441111 1.870803 -0.779092
C  4.483396 1.568706 -0.0326
H  -1.800119 1.792259 -0.600426
H  -3.528576 -2.0847 0.301021
H  0.47978 0.883631 -0.228597
H  -1.223962 -3.019605 0.685348
H  2.447686 0.173919 2.375785
H  2.938866 -0.967257 -1.785124
H  4.128593 2.020483 2.072373
H  4.626285 0.87257 -2.095399
H  -3.935404 2.104585 -1.734661
H  -4.031027 2.552884 -0.010987
H  -5.51984 2.058964 -0.888113
H  5.220053 2.368843 -0.164828
