program: Orca
programVersion: 5.0.2
elementType: Br Cl S P O O O C C C C C C C C C C C H H H H H H H H H H H H H H H
charge: 0
multiplicity: 1
keywords: wb97x-d3
keywords: def2-TZVPP
keywords: def2/J RIJCOSX
keywords: DEFGRID2
keywords: scfconv7
keywords: smallprint printgap noloewdin
keywords: NOSOSCF
formula: C11H15BrClO3PS
InChI: InChI=1/C11H15BrClO3PS/c1-3-7-18-17(14,15-4-2)16-11-6-5-9(12)8-10(11)13/h5-6,8H,3-4,7H2,1-2H3
33 atoms
Br 4.790608 -0.496794 0.286435
Cl 0.057479 1.819429 1.882969
S  -2.089875 -0.976847 0.973571
P  -2.116173 -0.075712 -0.902654
O  -0.928852 1.03013 -0.736568
O  -3.36967 0.887451 -1.001111
O  -1.996717 -1.0029 -2.035608
C  -2.737728 -2.62553 0.518914
C  -4.228505 -2.652161 0.232966
C  -4.712752 -4.068767 -0.044021
C  0.361483 0.648816 -0.522626
C  -3.747694 1.808028 0.032163
C  0.966066 0.98692 0.682242
C  1.085388 -0.038547 -1.483745
C  -5.063789 1.38847 0.641325
C  2.288511 0.656455 0.925998
C  2.40674 -0.380169 -1.249488
C  2.998805 -0.031138 -0.045264
H  -2.496261 -3.24871 1.382104
H  -2.16102 -2.996901 -0.327217
H  -4.769803 -2.229091 1.082277
H  -4.446995 -2.016766 -0.62759
H  -4.204185 -4.499204 -0.907507
H  -4.536086 -4.726517 0.808311
H  -5.781905 -4.081419 -0.253352
H  -2.974774 1.880837 0.801584
H  -3.824174 2.786964 -0.441538
H  0.611313 -0.304251 -2.418738
H  -5.842198 1.302427 -0.115883
H  -4.969176 0.432096 1.154482
H  -5.384057 2.132433 1.371067
H  2.744188 0.928942 1.86737
H  2.962386 -0.917235 -2.005137
totalener: -4428.04710337 hartree
nucrepener: 2242.20612890 hartree
electener: -6670.25323227 hartree
twoeener: 3925.70110774 hartree
kineticenergy: 4419.46450088 hartree
xcener: -190.174631819809 hartree
chargesum: 0.0000000
charge: -0.018289 -0.059708 -0.193684 0.780342 -0.342999 -0.311787 -0.505842 -0.070247 -0.112479 -0.255890 0.192773 0.026755 0.010910 -0.138328 -0.216087 -0.063326 -0.076634 -0.074476 0.109938 0.118920 0.059080 0.079484 0.086658 0.074313 0.088232 0.072178 0.097976 0.140586 0.094001 0.068814 0.085794 0.122207 0.130814
qa: -0.0183 -0.0597 -0.1937 0.7803 -0.3430 -0.3118 -0.5058 -0.0702 -0.1125 -0.2559 0.1928 0.0268 0.0109 -0.1383 -0.2161 -0.0633 -0.0766 -0.0745 0.1099 0.1189 0.0591 0.0795 0.0867 0.0743 0.0882 0.0722 0.0980 0.1406 0.0940 0.0688 0.0858 0.1222 0.1308
va: 1.2329 1.2521 2.2921 5.5125 2.1189 2.1257 2.1239 3.8814 3.9013 3.9780 3.8866 3.9135 3.9876 4.0420 3.9106 3.9124 3.9044 4.0532 1.0049 1.0269 1.0086 1.0189 1.0026 1.0022 1.0055 1.0057 0.9966 1.0168 1.0055 1.0179 1.0135 1.0105 1.0001
dispcorr: -0.017287728 hartree
energy: -4428.064391095854
dipole: -84.85811 84.08833 -0.76978 -11.89095 11.88364 -0.00731 -3.38613 4.15537 0.76924
magnitude: 1.08827 au
magnitude: 2.76617 debye
