program: Orca
programVersion: 5.0.2
elementType: Br Cl S P O O O C C C C C C C C C C C H H H H H H H H H H H H H H H
charge: 0
multiplicity: 1
keywords: wb97x-d3
keywords: def2-TZVPP
keywords: def2/J RIJCOSX
keywords: DEFGRID2
keywords: scfconv7
keywords: smallprint printgap noloewdin
keywords: NOSOSCF
formula: C11H15BrClO3PS
InChI: InChI=1/C11H15BrClO3PS/c1-3-7-18-17(14,15-4-2)16-11-6-5-9(12)8-10(11)13/h5-6,8H,3-4,7H2,1-2H3
33 atoms
Br 4.33712 -0.947204 0.342571
Cl -0.115324 1.667467 2.237871
S  -2.593179 -0.461553 0.703793
P  -2.264114 0.705292 -0.987113
O  -1.003874 1.662054 -0.562159
O  -3.416067 1.78601 -1.076488
O  -2.052288 -0.066929 -2.219848
C  -2.427452 -2.137378 -0.017303
C  -0.984719 -2.588753 -0.150876
C  -0.898437 -4.019033 -0.665935
C  0.214013 1.079026 -0.37484
C  -4.15485 2.358128 0.008323
C  0.748427 1.006573 0.906835
C  0.934931 0.565373 -1.442834
C  -3.41276 3.475787 0.705361
C  1.981792 0.412358 1.1249
C  2.167214 -0.030489 -1.237794
C  2.678069 -0.112281 0.048248
H  -2.948871 -2.165687 -0.972225
H  -2.974842 -2.775427 0.678994
H  -0.458779 -1.921738 -0.834632
H  -0.484284 -2.504147 0.815874
H  -1.353594 -4.113201 -1.652484
H  0.139923 -4.337598 -0.751533
H  -1.402565 -4.719895 0.001393
H  -5.070415 2.732189 -0.448123
H  -4.438938 1.573838 0.714929
H  0.522614 0.629575 -2.43989
H  -3.095369 4.240718 -0.002057
H  -4.078194 3.944587 1.43102
H  -2.534908 3.119288 1.24128
H  2.37914 0.359901 2.128663
H  2.715481 -0.430419 -2.078979
totalener: -4428.04420823 hartree
nucrepener: 2302.43696471 hartree
electener: -6730.48117294 hartree
twoeener: 3985.99071377 hartree
kineticenergy: 4419.46690041 hartree
xcener: -190.177226303054 hartree
chargesum: 0.0000000
charge: -0.016997 -0.056974 -0.196729 0.784246 -0.333904 -0.315644 -0.510176 -0.083834 -0.086045 -0.258124 0.189342 -0.000196 0.024235 -0.139653 -0.214720 -0.084715 -0.078232 -0.066014 0.115648 0.112478 0.066466 0.066458 0.086189 0.088790 0.075745 0.101546 0.085849 0.138931 0.090154 0.084667 0.077428 0.122139 0.131648
qa: -0.0170 -0.0570 -0.1967 0.7842 -0.3339 -0.3156 -0.5102 -0.0838 -0.0860 -0.2581 0.1893 -0.0002 0.0242 -0.1397 -0.2147 -0.0847 -0.0782 -0.0660 0.1156 0.1125 0.0665 0.0665 0.0862 0.0888 0.0757 0.1015 0.0858 0.1389 0.0902 0.0847 0.0774 0.1221 0.1316
va: 1.2339 1.2502 2.2807 5.5205 2.0992 2.1745 2.1113 3.8898 3.8861 3.9703 3.8622 3.9020 3.9814 3.9719 3.9076 3.9290 3.8769 4.0468 1.0278 1.0064 1.0201 1.0130 1.0016 1.0059 1.0034 0.9888 1.0076 1.0175 1.0084 1.0132 1.0238 1.0116 1.0003
dispcorr: -0.018904020 hartree
energy: -4428.063112249070
dipole: -59.93780 59.44139 -0.49641 -0.24740 0.18635 -0.06105 -7.56223 8.25927 0.69704
magnitude: 0.85791 au
magnitude: 2.18064 debye
