program: Orca
programVersion: 5.0.2
elementType: Br Cl S P O O O C C C C C C C C C C C H H H H H H H H H H H H H H H
charge: 0
multiplicity: 1
keywords: wb97x-d3
keywords: def2-TZVPP
keywords: def2/J RIJCOSX
keywords: DEFGRID2
keywords: scfconv7
keywords: smallprint printgap noloewdin
keywords: NOSOSCF
formula: C11H15BrClO3PS
InChI: InChI=1/C11H15BrClO3PS/c1-3-7-18-17(14,15-4-2)16-11-6-5-9(12)8-10(11)13/h5-6,8H,3-4,7H2,1-2H3
33 atoms
Br 4.338631 -0.941244 0.346408
Cl -0.116447 1.667357 2.243965
S  -2.595469 -0.464828 0.702164
P  -2.263325 0.705426 -0.986575
O  -1.005695 1.662583 -0.555616
O  -3.416772 1.784758 -1.077238
O  -2.047033 -0.063809 -2.220181
C  -2.426811 -2.137834 -0.024738
C  -0.983329 -2.589047 -0.153568
C  -0.89496 -4.016306 -0.677208
C  0.213319 1.081152 -0.36928
C  -4.153806 2.359441 0.007526
C  0.748144 1.008832 0.912357
C  0.934797 0.569363 -1.437779
C  -3.408552 3.473044 0.707919
C  1.982527 0.416234 1.129655
C  2.167562 -0.025607 -1.233242
C  2.678647 -0.107849 0.052609
H  -2.943667 -2.162508 -0.982429
H  -2.977614 -2.778906 0.666332
H  -0.45333 -1.918049 -0.83044
H  -0.487998 -2.510671 0.81659
H  -1.397677 -4.721807 -0.013612
H  -1.350526 -4.105487 -1.664097
H  0.143954 -4.332657 -0.765253
H  -5.066808 2.738729 -0.449858
H  -4.442907 1.575416 0.712535
H  0.522139 0.633509 -2.43465
H  -3.09144 4.240956 0.003634
H  -4.072402 3.938984 1.436835
H  -2.530388 3.11325 1.241062
H  2.380279 0.363936 2.133339
H  2.71561 -0.425065 -2.074742
totalener: -4428.04425046 hartree
nucrepener: 2302.31033657 hartree
electener: -6730.35458703 hartree
twoeener: 3985.86349379 hartree
kineticenergy: 4419.46354617 hartree
xcener: -190.176586228740 hartree
chargesum: 0.0000000
charge: -0.017026 -0.056885 -0.196640 0.784511 -0.333915 -0.315691 -0.510109 -0.083873 -0.085601 -0.258233 0.188777 -0.000472 0.024076 -0.139319 -0.214740 -0.084311 -0.078135 -0.066273 0.115572 0.112466 0.065945 0.066543 0.075949 0.086057 0.088792 0.101540 0.085844 0.138955 0.090179 0.084612 0.077598 0.122125 0.131680
qa: -0.0170 -0.0569 -0.1966 0.7845 -0.3339 -0.3157 -0.5101 -0.0839 -0.0856 -0.2582 0.1888 -0.0005 0.0241 -0.1393 -0.2147 -0.0843 -0.0781 -0.0663 0.1156 0.1125 0.0659 0.0665 0.0759 0.0861 0.0888 0.1015 0.0858 0.1390 0.0902 0.0846 0.0776 0.1221 0.1317
va: 1.2339 1.2503 2.2804 5.5198 2.0991 2.1745 2.1112 3.8897 3.8862 3.9703 3.8623 3.9024 3.9820 3.9719 3.9073 3.9290 3.8769 4.0471 1.0279 1.0064 1.0201 1.0131 1.0034 1.0016 1.0059 0.9888 1.0074 1.0177 1.0085 1.0133 1.0241 1.0115 1.0003
dispcorr: -0.018905148 hartree
energy: -4428.063155611843
dipole: -59.92366 59.42731 -0.49635 -0.29079 0.23095 -0.05984 -7.64561 8.33963 0.69402
magnitude: 0.85535 au
magnitude: 2.17412 debye
