program: Orca
programVersion: 5.0.2
elementType: Br Cl S P O O O C C C C C C C C C C C H H H H H H H H H H H H H H H
charge: 0
multiplicity: 1
keywords: wb97x-d3
keywords: def2-TZVPP
keywords: def2/J RIJCOSX
keywords: DEFGRID2
keywords: scfconv7
keywords: smallprint printgap noloewdin
keywords: NOSOSCF
formula: C11H15BrClO3PS
InChI: InChI=1/C11H15BrClO3PS/c1-3-7-18-17(14,15-4-2)16-11-6-5-9(12)8-10(11)13/h5-6,8H,3-4,7H2,1-2H3
33 atoms
Br 4.279672 -0.522048 1.280585
Cl 0.771661 0.06466 -2.916278
S  -2.515547 -0.984116 0.64986
P  -2.565162 0.822972 -0.372298
O  -1.068958 1.081334 -0.944066
O  -2.61771 1.902623 0.804494
O  -3.574367 0.927629 -1.433475
C  -3.015979 -2.112408 -0.706782
C  -1.951931 -2.345027 -1.765566
C  -0.66403 -2.95232 -1.235313
C  0.114071 0.723969 -0.386705
C  -3.864665 2.450722 1.262793
C  1.099066 0.228402 -1.237172
C  0.395163 0.852312 0.965999
C  -4.601647 1.519492 2.198935
C  2.341058 -0.139779 -0.74722
C  1.63027 0.47789 1.467985
C  2.596905 -0.017753 0.608672
H  -3.933749 -1.722319 -1.143391
H  -3.261498 -3.041121 -0.188165
H  -2.390524 -3.011504 -2.514222
H  -1.745757 -1.410954 -2.290446
H  -0.198106 -2.318715 -0.480531
H  -0.843261 -3.928546 -0.78164
H  0.057229 -3.08765 -2.04026
H  -3.592081 3.373582 1.773404
H  -4.48465 2.714043 0.404082
H  -0.34669 1.257088 1.639542
H  -3.976306 1.219064 3.039127
H  -5.477417 2.031997 2.597796
H  -4.945676 0.618917 1.692567
H  3.089001 -0.522202 -1.427181
H  1.82792 0.579676 2.525612
totalener: -4428.04366826 hartree
nucrepener: 2288.13896026 hartree
electener: -6716.18262852 hartree
twoeener: 3971.60252154 hartree
kineticenergy: 4419.45957179 hartree
xcener: -190.178363091903 hartree
chargesum: -0.0000000
charge: -0.018254 -0.048125 -0.177813 0.765800 -0.306590 -0.332226 -0.497848 -0.108207 -0.121092 -0.250780 0.187812 0.005893 -0.008625 -0.132636 -0.240260 -0.050959 -0.094724 -0.068831 0.133971 0.110911 0.078465 0.071118 0.072901 0.088156 0.093166 0.094673 0.104433 0.137075 0.086059 0.089691 0.091089 0.118365 0.127395
qa: -0.0183 -0.0481 -0.1778 0.7658 -0.3066 -0.3322 -0.4978 -0.1082 -0.1211 -0.2508 0.1878 0.0059 -0.0086 -0.1326 -0.2403 -0.0510 -0.0947 -0.0688 0.1340 0.1109 0.0785 0.0711 0.0729 0.0882 0.0932 0.0947 0.1044 0.1371 0.0861 0.0897 0.0911 0.1184 0.1274
va: 1.2336 1.2646 2.2652 5.5070 2.1454 2.1151 2.1354 3.8906 3.8683 3.9183 3.8973 3.8988 3.9503 3.9366 3.8993 3.8885 3.9474 4.0612 1.0223 1.0040 1.0134 1.0350 1.0085 1.0090 1.0093 0.9895 1.0054 1.0233 1.0037 1.0134 1.0140 1.0158 1.0033
dispcorr: -0.019493500 hartree
energy: -4428.063161757910
dipole: -66.80947 66.36817 -0.44130 -2.64788 2.35644 -0.29144 -4.99081 6.08822 1.09741
magnitude: 1.21819 au
magnitude: 3.09640 debye
