program: Orca
programVersion: 5.0.2
elementType: S P O O O N N N C C C C C C C C C C C H H H H H H H H H H H H H H H H H H H H
charge: 0
multiplicity: 1
keywords: wb97x-d3
keywords: def2-TZVPP
keywords: def2/J RIJCOSX
keywords: DEFGRID2
keywords: scfconv7
keywords: smallprint printgap noloewdin
keywords: NOSOSCF
formula: C11H20N3O3PS
InChI: InChI=1/C11H20N3O3PS/c1-6-14(7-2)11-12-9(3)8-10(13-11)17-18(19,15-4)16-5/h8H,6-7H2,1-5H3
39 atoms
S  2.415731 -1.000187 -1.595738
P  2.344175 0.229015 -0.12833
O  1.267217 1.449362 -0.194223
O  2.182501 -0.368986 1.336268
O  3.586583 1.215791 0.032053
N  -2.440368 -1.242389 -0.057659
N  -2.739001 1.037142 0.075584
N  -0.569366 0.092703 -0.097744
C  -3.878294 -1.451936 -0.005926
C  -1.610707 -2.42888 -0.190132
C  -1.906714 -0.008378 -0.02548
C  -4.404482 -1.61394 1.409288
C  -1.316152 -2.795487 -1.634257
C  -2.207373 2.251451 0.060911
C  -0.078315 1.304169 -0.109171
C  -0.836529 2.458547 -0.045891
C  -3.132833 3.418313 0.170115
C  1.771396 -1.699386 1.657738
C  4.92025 0.697067 0.044506
H  -4.387379 -0.631949 -0.507343
H  -4.095179 -2.350315 -0.585975
H  -0.683301 -2.292166 0.360372
H  -2.138847 -3.248288 0.299375
H  -4.242093 -0.712194 1.999587
H  -5.475961 -1.816037 1.392047
H  -3.917688 -2.446198 1.920038
H  -0.720399 -3.708001 -1.675186
H  -2.235777 -2.974141 -2.193496
H  -0.755991 -2.008868 -2.139373
H  -0.398503 3.445758 -0.059363
H  -2.866504 4.043112 1.023408
H  -3.061783 4.047867 -0.717997
H  -4.165198 3.096361 0.283555
H  0.758429 -1.677836 2.052813
H  2.449956 -2.075389 2.419971
H  1.811549 -2.355333 0.788938
H  5.585916 1.55487 0.08374
H  5.129124 0.122581 -0.857982
H  5.091132 0.071841 0.920941
elementType: S P O N C H
totalener: -1560.91775438 hartree
nucrepener: 1902.80582060 hartree
electener: -3463.72357498 hartree
oneelecener: -5926.49077543 hartree
twoeener: 2462.76720046 hartree
cpcmener: -0.02365252 hartree
kineticenergy: 1555.86789747 hartree
xcener: -114.794216723750 hartree
chargesum: 0.0000000
charge: -0.444539 0.763228 -0.315431 -0.336730 -0.344139 -0.117042 -0.436911 -0.423683 -0.016366 -0.014969 0.407155 -0.266756 -0.274283 0.160706 0.376292 -0.311950 -0.244043 -0.084367 -0.125601 0.081972 0.095405 0.078924 0.099070 0.080637 0.093783 0.083276 0.095509 0.091058 0.071201 0.147908 0.107394 0.108281 0.092624 0.116634 0.134078 0.104503 0.130429 0.109175 0.127567
qa: -0.4445 0.7632 -0.3154 -0.3367 -0.3441 -0.1170 -0.4369 -0.4237 -0.0164 -0.0150 0.4072 -0.2668 -0.2743 0.1607 0.3763 -0.3119 -0.2440 -0.0844 -0.1256 0.0820 0.0954 0.0789 0.0991 0.0806 0.0938 0.0833 0.0955 0.0911 0.0712 0.1479 0.1074 0.1083 0.0926 0.1166 0.1341 0.1045 0.1304 0.1092 0.1276
va: 1.9865 5.4903 2.1876 2.0812 2.1046 3.1585 2.9902 2.9569 3.8403 3.8592 4.0792 3.9279 3.9215 3.9268 4.0052 3.8991 3.9097 3.8215 3.8509 1.0258 0.9950 1.0124 0.9987 1.0094 1.0071 1.0036 1.0063 1.0072 1.0151 1.0053 0.9974 0.9969 1.0215 0.9857 0.9908 1.0084 0.9902 1.0019 0.9855
dispcorr: -0.019042876 hartree
energy: -1560.936797254070
dipole: -19.94327 19.58592 -0.35735 -11.30587 10.59986 -0.70601 5.66341 -4.31564 1.34778
magnitude: 1.56290 au
magnitude: 3.97257 debye
