program: Orca
programVersion: 5.0.2
elementType: S P O O O N N N C C C C C C C C C C C H H H H H H H H H H H H H H H H H H H H
charge: 0
multiplicity: 1
keywords: wb97x-d3
keywords: def2-TZVPP
keywords: def2/J RIJCOSX
keywords: DEFGRID2
keywords: scfconv7
keywords: smallprint printgap noloewdin
keywords: NOSOSCF
formula: C11H20N3O3PS
InChI: InChI=1/C11H20N3O3PS/c1-6-14(7-2)11-12-9(3)8-10(13-11)17-18(19,15-4)16-5/h8H,6-7H2,1-5H3
39 atoms
S  2.317343 -0.539691 -2.095995
P  2.313506 0.164101 -0.319184
O  1.28272 1.377541 0.040831
O  2.1063 -0.966251 0.782764
O  3.597385 1.010523 0.116399
N  -2.44674 -1.197612 -0.579283
N  -2.741437 1.024346 -0.01539
N  -0.577245 0.088441 -0.245213
C  -3.881871 -1.415528 -0.480043
C  -1.578101 -2.354471 -0.747453
C  -1.914659 0.000405 -0.263168
C  -4.39191 -1.659965 0.931105
C  -1.095379 -2.986784 0.548528
C  -2.195619 2.205752 0.242899
C  -0.070099 1.264756 0.008918
C  -0.817973 2.398917 0.26326
C  -3.113695 3.353275 0.510428
C  2.008283 -0.660314 2.183247
C  4.905099 0.444318 -0.028808
H  -4.400663 -0.564039 -0.916616
H  -4.117229 -2.274142 -1.10902
H  -2.13706 -3.088752 -1.32764
H  -0.721701 -2.067881 -1.356772
H  -3.968848 -2.565196 1.365322
H  -4.160487 -0.825148 1.592047
H  -5.476133 -1.778737 0.913666
H  -0.562131 -2.272583 1.175445
H  -1.919562 -3.398482 1.130084
H  -0.410934 -3.805365 0.322041
H  -0.370101 3.35796 0.478478
H  -4.147496 3.025217 0.586599
H  -2.838675 3.864379 1.433237
H  -3.046295 4.089095 -0.292594
H  2.060942 -1.609417 2.709301
H  1.05745 -0.180036 2.412674
H  2.827698 -0.02395 2.516011
H  5.608295 1.19997 0.309755
H  5.112846 0.200474 -1.070604
H  5.020491 -0.450479 0.58315
elementType: S P O N C H
totalener: -1560.91888849 hartree
nucrepener: 1910.80931437 hartree
electener: -3471.72820286 hartree
oneelecener: -5942.54390317 hartree
twoeener: 2470.81570031 hartree
cpcmener: -0.02790312 hartree
kineticenergy: 1555.85686693 hartree
xcener: -114.787863739385 hartree
chargesum: 0.0000000
charge: -0.432465 0.756999 -0.313154 -0.338288 -0.348046 -0.140998 -0.435495 -0.403838 0.001517 0.007054 0.403078 -0.283817 -0.294708 0.162988 0.355097 -0.305697 -0.245559 -0.123740 -0.128911 0.081285 0.090013 0.091871 0.072862 0.089154 0.084872 0.097116 0.080185 0.098581 0.099185 0.148473 0.093418 0.106479 0.109707 0.133456 0.122090 0.136651 0.131167 0.112897 0.128520
qa: -0.4325 0.7570 -0.3132 -0.3383 -0.3480 -0.1410 -0.4355 -0.4038 0.0015 0.0071 0.4031 -0.2838 -0.2947 0.1630 0.3551 -0.3057 -0.2456 -0.1237 -0.1289 0.0813 0.0900 0.0919 0.0729 0.0892 0.0849 0.0971 0.0802 0.0986 0.0992 0.1485 0.0934 0.1065 0.1097 0.1335 0.1221 0.1367 0.1312 0.1129 0.1285
va: 2.0230 5.4819 2.1598 2.0557 2.0858 3.1912 2.9831 2.9219 3.8291 3.8344 4.0928 3.9121 3.9157 3.9227 4.0043 3.9119 3.9147 3.8258 3.8490 1.0233 1.0021 1.0045 1.0237 1.0014 1.0104 1.0073 1.0013 1.0024 1.0066 1.0046 1.0205 0.9979 0.9967 0.9868 0.9884 0.9940 0.9903 1.0039 0.9833
dispcorr: -0.019713802 hartree
energy: -1560.938602290128
dipole: -18.46880 18.41292 -0.05587 -9.13238 9.15253 0.02015 12.52049 -10.27150 2.24899
magnitude: 2.24978 au
magnitude: 5.71848 debye
