program: Orca
programVersion: 5.0.2
elementType: S P O O O N N N C C C C C C C C C C C H H H H H H H H H H H H H H H H H H H H
charge: 0
multiplicity: 1
keywords: wb97x-d3
keywords: def2-TZVPP
keywords: def2/J RIJCOSX
keywords: DEFGRID2
keywords: scfconv7
keywords: smallprint printgap noloewdin
keywords: NOSOSCF
formula: C11H20N3O3PS
InChI: InChI=1/C11H20N3O3PS/c1-6-14(7-2)11-12-9(3)8-10(13-11)17-18(19,15-4)16-5/h8H,6-7H2,1-5H3
39 atoms
S  2.372909 -0.753402 -1.952403
P  2.377751 -0.075142 -0.165181
O  1.402159 1.206229 0.143546
O  2.072195 -1.16229 0.946514
O  3.745777 0.557363 0.352197
N  -2.410837 -1.214868 -0.566185
N  -2.627143 1.038603 -0.099688
N  -0.501325 -0.000139 -0.190021
C  -3.856609 -1.367725 -0.505548
C  -1.588055 -2.411825 -0.674215
C  -1.838218 -0.030156 -0.270184
C  -4.421987 -1.511449 0.898692
C  -1.204802 -3.044977 0.653693
C  -2.039325 2.203836 0.137757
C  0.049023 1.161902 0.041796
C  -0.656448 2.337317 0.213674
C  -2.913267 3.400149 0.322891
C  1.898306 -0.8343 2.335279
C  4.493963 1.480907 -0.447119
H  -4.324081 -0.521485 -1.006178
H  -4.108342 -2.249831 -1.094469
H  -2.146468 -3.129083 -1.276371
H  -0.688048 -2.170872 -1.238909
H  -4.060436 -2.413518 1.390935
H  -4.166799 -0.65651 1.524146
H  -5.509967 -1.57455 0.851462
H  -2.076361 -3.410979 1.195487
H  -0.545882 -3.896312 0.477488
H  -0.675637 -2.343194 1.29807
H  -0.174381 3.28351 0.411538
H  -3.965322 3.126157 0.3387
H  -2.671953 3.915488 1.252944
H  -2.755969 4.115257 -0.486061
H  1.795248 -1.779083 2.861246
H  0.997822 -0.241441 2.492178
H  2.761348 -0.299854 2.730175
H  4.645731 1.093658 -1.454839
H  5.458517 1.604555 0.038056
H  3.990954 2.446354 -0.499776
elementType: S P O N C H
totalener: -1560.91868514 hartree
nucrepener: 1914.58897498 hartree
electener: -3475.50766011 hartree
oneelecener: -5950.09181350 hartree
twoeener: 2474.58415338 hartree
cpcmener: -0.02600651 hartree
kineticenergy: 1555.86304965 hartree
xcener: -114.790217044885 hartree
chargesum: 0.0000000
charge: -0.432896 0.764584 -0.317144 -0.346061 -0.347924 -0.140980 -0.435593 -0.403365 0.003822 0.004818 0.402686 -0.285310 -0.294482 0.159920 0.356605 -0.300978 -0.244454 -0.129485 -0.108639 0.080509 0.089566 0.092457 0.072836 0.089705 0.085290 0.097137 0.099258 0.099424 0.080045 0.148139 0.092612 0.106401 0.109568 0.133206 0.120232 0.138078 0.104483 0.129151 0.126781
qa: -0.4329 0.7646 -0.3171 -0.3461 -0.3479 -0.1410 -0.4356 -0.4034 0.0038 0.0048 0.4027 -0.2853 -0.2945 0.1599 0.3566 -0.3010 -0.2445 -0.1295 -0.1086 0.0805 0.0896 0.0925 0.0728 0.0897 0.0853 0.0971 0.0993 0.0994 0.0800 0.1481 0.0926 0.1064 0.1096 0.1332 0.1202 0.1381 0.1045 0.1292 0.1268
va: 2.0154 5.4737 2.1290 2.0859 2.0995 3.1920 2.9841 2.9162 3.8276 3.8357 4.0925 3.9126 3.9133 3.9232 4.0050 3.9036 3.9131 3.8330 3.8387 1.0233 1.0020 1.0046 1.0239 1.0013 1.0107 1.0072 1.0021 1.0067 1.0007 1.0045 1.0210 0.9978 0.9967 0.9859 0.9867 0.9971 1.0044 0.9888 0.9878
dispcorr: -0.019629965 hartree
energy: -1560.938315099919
dipole: -20.63069 20.17621 -0.45448 -4.22889 5.24431 1.01542 10.25461 -8.46528 1.78932
magnitude: 2.10697 au
magnitude: 5.35548 debye
