program: Orca
programVersion: 5.0.2
elementType: S P O O O N N N C C C C C C C C C C C H H H H H H H H H H H H H H H H H H H H
charge: 0
multiplicity: 1
keywords: wb97x-d3
keywords: def2-TZVPP
keywords: def2/J RIJCOSX
keywords: DEFGRID2
keywords: scfconv7
keywords: smallprint printgap noloewdin
keywords: NOSOSCF
formula: C11H20N3O3PS
InChI: InChI=1/C11H20N3O3PS/c1-6-14(7-2)11-12-9(3)8-10(13-11)17-18(19,15-4)16-5/h8H,6-7H2,1-5H3
39 atoms
S  2.364662 -0.731739 -1.951717
P  2.393428 -0.065463 -0.161233
O  1.410229 1.207248 0.173855
O  2.118956 -1.158518 0.952525
O  3.764901 0.578866 0.335916
N  -2.401262 -1.226214 -0.490879
N  -2.616978 1.030397 -0.068186
N  -0.489674 -0.006334 -0.135921
C  -3.849587 -1.358146 -0.502382
C  -1.583377 -2.418434 -0.652342
C  -1.82592 -0.038239 -0.22396
C  -4.482744 -1.466457 0.875928
C  -1.219023 -3.113353 0.64979
C  -2.033149 2.200441 0.147973
C  0.060047 1.161002 0.070956
C  -0.649676 2.339063 0.219266
C  -2.919811 3.392223 0.31372
C  1.936212 -0.83524 2.338614
C  4.49867 1.501532 -0.47287
H  -4.282725 -0.515124 -1.039936
H  -4.083918 -2.250197 -1.083628
H  -2.139182 -3.105539 -1.291531
H  -0.675183 -2.15607 -1.193741
H  -4.1257 -2.342877 1.417142
H  -4.2779 -0.583625 1.481046
H  -5.56596 -1.556966 0.778886
H  -2.102688 -3.466893 1.181445
H  -0.591056 -3.980904 0.440976
H  -0.662046 -2.454627 1.315965
H  -0.17131 3.291424 0.396673
H  -3.968339 3.101974 0.315862
H  -2.700198 3.91596 1.245065
H  -2.761621 4.105598 -0.497079
H  1.90211 -1.7817 2.871591
H  0.998085 -0.305829 2.500555
H  2.762464 -0.241095 2.727161
H  4.64516 1.113822 -1.480964
H  5.466253 1.633342 0.003046
H  3.991945 2.464823 -0.526506
elementType: S P O N C H
totalener: -1560.93071332 hartree
nucrepener: 1911.76187866 hartree
electener: -3472.69259198 hartree
oneelecener: -5944.31119620 hartree
twoeener: 2471.61860421 hartree
cpcmener: -0.02184120 hartree
kineticenergy: 1555.85860043 hartree
xcener: -114.788986009263 hartree
chargesum: -0.0000000
charge: -0.425279 0.758464 -0.316304 -0.335202 -0.342532 -0.132916 -0.432685 -0.402804 0.000873 -0.001187 0.408430 -0.281143 -0.283270 0.158388 0.356291 -0.304552 -0.246408 -0.130372 -0.110822 0.081121 0.087915 0.090432 0.074958 0.085960 0.085924 0.095118 0.093629 0.096998 0.079267 0.144528 0.094025 0.104670 0.108088 0.131854 0.115782 0.136288 0.105246 0.126911 0.124316
qa: -0.4253 0.7585 -0.3163 -0.3352 -0.3425 -0.1329 -0.4327 -0.4028 0.0009 -0.0012 0.4084 -0.2811 -0.2833 0.1584 0.3563 -0.3046 -0.2464 -0.1304 -0.1108 0.0811 0.0879 0.0904 0.0750 0.0860 0.0859 0.0951 0.0936 0.0970 0.0793 0.1445 0.0940 0.1047 0.1081 0.1319 0.1158 0.1363 0.1052 0.1269 0.1243
va: 2.0228 5.4778 2.1301 2.0943 2.1041 3.1934 2.9843 2.9185 3.8269 3.8397 4.0809 3.9141 3.9163 3.9240 4.0146 3.9077 3.9098 3.8402 3.8453 1.0230 1.0022 1.0044 1.0245 1.0021 1.0114 1.0075 1.0026 1.0076 1.0008 1.0058 1.0210 0.9981 0.9971 0.9865 0.9878 0.9967 1.0046 0.9891 0.9877
dispcorr: -0.019471758 hartree
energy: -1560.950185082892
dipole: -20.86475 20.42481 -0.43994 -4.29738 5.23059 0.93321 9.83770 -8.21937 1.61833
magnitude: 1.91922 au
magnitude: 4.87828 debye
