program: Orca
programVersion: 5.0.2
elementType: S P O O O N N N C C C C C C C C C C C H H H H H H H H H H H H H H H H H H H H
charge: 0
multiplicity: 1
keywords: wb97x-d3
keywords: def2-TZVPP
keywords: def2/J RIJCOSX
keywords: DEFGRID2
keywords: scfconv7
keywords: smallprint printgap noloewdin
keywords: NOSOSCF
formula: C11H20N3O3PS
InChI: InChI=1/C11H20N3O3PS/c1-6-14(7-2)11-12-9(3)8-10(13-11)17-18(19,15-4)16-5/h8H,6-7H2,1-5H3
39 atoms
S  2.273762 -0.70681 -1.930755
P  2.402064 -0.088446 -0.13799
O  1.424507 1.170558 0.281809
O  2.222119 -1.19133 0.987009
O  3.789331 0.582571 0.296108
N  -2.423639 -1.265211 0.009439
N  -2.600318 1.028648 0.003081
N  -0.491455 -0.040933 0.160147
C  -3.855404 -1.37834 -0.189814
C  -1.641411 -2.486848 0.074265
C  -1.828472 -0.058643 0.056733
C  -4.639236 -1.364709 1.113156
C  -1.113712 -2.928095 -1.281467
C  -1.994913 2.20785 0.025026
C  0.078669 1.132197 0.173084
C  -0.614458 2.332817 0.10664
C  -2.879945 3.411296 -0.058329
C  2.047064 -0.868921 2.362344
C  4.40776 1.564534 -0.525147
H  -4.194259 -0.568423 -0.833398
H  -4.037402 -2.310016 -0.729968
H  -0.81016 -2.348135 0.763552
H  -2.283631 -3.258823 0.504081
H  -4.498467 -0.417988 1.632754
H  -5.705342 -1.488632 0.919747
H  -4.325997 -2.171022 1.777627
H  -0.411018 -2.196779 -1.678261
H  -0.587078 -3.878558 -1.192454
H  -1.923632 -3.060911 -2.00031
H  -0.11476 3.289336 0.11666
H  -3.324497 3.47877 -1.052689
H  -3.700599 3.327958 0.65385
H  -2.336492 4.334547 0.135132
H  2.221357 -1.785643 2.920214
H  1.028435 -0.528138 2.54983
H  2.754528 -0.112487 2.703422
H  5.404598 1.730445 -0.124107
H  3.854166 2.504858 -0.501896
H  4.486067 1.22132 -1.557772
totalener: -1560.91242254 hartree
nucrepener: 1911.35514935 hartree
electener: -3472.26757189 hartree
oneelecener: -5942.61258177 hartree
twoeener: 2470.34500988 hartree
kineticenergy: 1555.90901963 hartree
xcener: -114.796409983605 hartree
chargesum: -0.0000000
charge: -0.362695 0.736143 -0.312374 -0.299122 -0.324866 -0.124003 -0.410692 -0.392222 -0.022139 -0.021207 0.408808 -0.248710 -0.238151 0.149692 0.344982 -0.264811 -0.238100 -0.132855 -0.123569 0.084010 0.082202 0.078315 0.081100 0.089220 0.081751 0.069758 0.094422 0.079767 0.068406 0.111844 0.098432 0.097881 0.081655 0.121011 0.101329 0.120691 0.114617 0.110760 0.108721
qa: -0.3627 0.7361 -0.3124 -0.2991 -0.3249 -0.1240 -0.4107 -0.3922 -0.0221 -0.0212 0.4088 -0.2487 -0.2382 0.1497 0.3450 -0.2648 -0.2381 -0.1329 -0.1236 0.0840 0.0822 0.0783 0.0811 0.0892 0.0818 0.0698 0.0944 0.0798 0.0684 0.1118 0.0984 0.0979 0.0817 0.1210 0.1013 0.1207 0.1146 0.1108 0.1087
va: 2.0858 5.4741 2.1200 2.1149 2.1113 3.1660 2.9963 2.9297 3.8589 3.8851 4.0762 3.9248 3.9271 3.9480 4.0816 3.9541 3.9492 3.8755 3.8768 1.0287 0.9940 1.0133 0.9921 1.0125 1.0108 1.0068 1.0221 1.0126 1.0085 1.0148 1.0031 1.0089 1.0086 0.9898 0.9919 0.9968 0.9902 0.9884 1.0064
dispcorr: -0.019144332 hartree
energy: -1560.931566868105
dipole: -21.00641 20.69905 -0.30736 -3.53021 4.17097 0.64077 5.56667 -4.50840 1.05828
magnitude: 1.27476 au
magnitude: 3.24017 debye
