program: Orca
programVersion: 5.0.2
elementType: S P O O O N N N C C C C C C C C C C C H H H H H H H H H H H H H H H H H H H H
charge: 0
multiplicity: 1
keywords: wb97x-d3
keywords: def2-TZVPP
keywords: def2/J RIJCOSX
keywords: DEFGRID2
keywords: scfconv7
keywords: smallprint printgap noloewdin
keywords: NOSOSCF
formula: C11H20N3O3PS
InChI: InChI=1/C11H20N3O3PS/c1-6-14(7-2)11-12-9(3)8-10(13-11)17-18(19,15-4)16-5/h8H,6-7H2,1-5H3
39 atoms
S  2.150978 -0.878709 -1.867866
P  2.369388 -0.087287 -0.152986
O  1.419278 1.209434 0.214722
O  2.246892 -1.07767 1.080862
O  3.775069 0.618834 0.143865
N  -2.40058 -1.266802 -0.016161
N  -2.613265 1.015239 0.216186
N  -0.485042 -0.023626 0.136568
C  -3.842091 -1.411444 0.030476
C  -1.595376 -2.448817 -0.273069
C  -1.822448 -0.058702 0.114722
C  -4.507896 -1.217566 -1.323431
C  -1.113349 -3.131817 0.996405
C  -2.023286 2.196551 0.307222
C  0.070394 1.156547 0.201701
C  -0.639846 2.342597 0.288975
C  -2.910772 3.397278 0.415539
C  2.182776 -0.632432 2.430581
C  4.418484 1.414963 -0.841562
H  -4.056592 -2.410549 0.416714
H  -4.249688 -0.70109 0.747739
H  -2.208415 -3.135794 -0.860954
H  -0.740601 -2.178836 -0.892684
H  -5.582699 -1.386654 -1.248544
H  -4.349081 -0.202781 -1.684858
H  -4.113572 -1.911592 -2.066779
H  -0.443187 -2.476738 1.550303
H  -1.945211 -3.408328 1.646045
H  -0.562767 -4.040344 0.751351
H  -0.154049 3.30512 0.345555
H  -2.666731 3.98535 1.300935
H  -2.782136 4.050056 -0.449093
H  -3.953803 3.096643 0.469838
H  2.322312 -1.51292 3.053079
H  1.207598 -0.197173 2.651774
H  2.965767 0.089728 2.663851
H  5.416332 1.632665 -0.468389
H  3.88626 2.354152 -1.001509
H  4.494536 0.882065 -1.790048
totalener: -1560.91128378 hartree
nucrepener: 1912.29638516 hartree
electener: -3473.20766893 hartree
oneelecener: -5944.54619804 hartree
twoeener: 2471.33852911 hartree
kineticenergy: 1555.91577311 hartree
xcener: -114.797324214465 hartree
chargesum: 0.0000000
charge: -0.364458 0.739916 -0.311795 -0.300635 -0.326924 -0.127519 -0.396445 -0.387658 -0.026464 -0.023895 0.415113 -0.247914 -0.240626 0.145758 0.338948 -0.276417 -0.255086 -0.142963 -0.125677 0.082517 0.082546 0.080336 0.092522 0.080677 0.092139 0.071599 0.079660 0.071654 0.086046 0.115954 0.094133 0.097759 0.100287 0.122832 0.102656 0.126189 0.113651 0.110776 0.110809
qa: -0.3645 0.7399 -0.3118 -0.3006 -0.3269 -0.1275 -0.3964 -0.3877 -0.0265 -0.0239 0.4151 -0.2479 -0.2406 0.1458 0.3389 -0.2764 -0.2551 -0.1430 -0.1257 0.0825 0.0825 0.0803 0.0925 0.0807 0.0921 0.0716 0.0797 0.0717 0.0860 0.1160 0.0941 0.0978 0.1003 0.1228 0.1027 0.1262 0.1137 0.1108 0.1108
va: 2.0829 5.4731 2.1332 2.1174 2.1089 3.1677 3.0026 2.9267 3.8707 3.8745 4.0594 3.9221 3.9305 3.9420 4.0672 3.9341 3.9006 3.8795 3.8806 0.9928 1.0261 0.9957 1.0251 1.0104 1.0124 1.0073 1.0049 1.0069 1.0118 1.0156 1.0002 0.9990 1.0225 0.9878 0.9879 0.9970 0.9904 0.9874 1.0063
dispcorr: -0.019189113 hartree
energy: -1560.930472888488
dipole: -20.00946 19.79544 -0.21402 -3.34976 4.04936 0.69960 5.23637 -4.25722 0.97915
magnitude: 1.22229 au
magnitude: 3.10681 debye
