program: Orca
programVersion: 5.0.2
elementType: S P O O O N N N C C C C C C C C C C C H H H H H H H H H H H H H H H H H H H H
charge: 0
multiplicity: 1
keywords: wb97x-d3
keywords: def2-TZVPP
keywords: def2/J RIJCOSX
keywords: DEFGRID2
keywords: scfconv7
keywords: smallprint printgap noloewdin
keywords: NOSOSCF
formula: C11H20N3O3PS
InChI: InChI=1/C11H20N3O3PS/c1-6-14(7-2)11-12-9(3)8-10(13-11)17-18(19,15-4)16-5/h8H,6-7H2,1-5H3
39 atoms
S  2.250535 -1.293011 -1.385547
P  2.312348 0.154563 -0.140335
O  1.234035 1.37083 -0.258542
O  2.308333 -0.222892 1.411771
O  3.570682 1.128371 -0.240595
N  -2.404182 -1.313226 0.461658
N  -2.725903 0.962821 0.381573
N  -0.561719 0.025804 0.144977
C  -3.834374 -1.481806 0.645118
C  -1.577335 -2.483696 0.222541
C  -1.88587 -0.0739 0.323472
C  -4.646327 -1.431865 -0.641426
C  -1.307911 -2.780318 -1.245919
C  -2.214003 2.173649 0.220626
C  -0.087135 1.231172 -0.038481
C  -0.861929 2.379889 -0.021118
C  -3.16197 3.33019 0.289243
C  1.806568 -1.438527 1.944821
C  4.872831 0.591759 -0.423485
H  -3.983353 -2.441948 1.142307
H  -4.19147 -0.71246 1.327831
H  -0.626086 -2.361353 0.737822
H  -2.081833 -3.330598 0.690185
H  -5.705141 -1.572583 -0.420957
H  -4.531705 -0.466805 -1.131947
H  -4.348046 -2.211727 -1.341616
H  -0.691073 -3.675065 -1.334925
H  -2.229661 -2.953017 -1.800884
H  -0.761338 -1.963814 -1.714189
H  -0.437601 3.361123 -0.171522
H  -2.785388 4.109224 0.952265
H  -3.288373 3.780147 -0.696928
H  -4.136399 3.003866 0.643481
H  0.78872 -1.294082 2.303513
H  2.449169 -1.717351 2.777727
H  1.815896 -2.235434 1.199905
H  5.209692 0.054934 0.465227
H  5.53554 1.435683 -0.597852
H  4.909091 -0.080473 -1.281643
totalener: -1560.91093981 hartree
nucrepener: 1915.65975369 hartree
electener: -3476.57069349 hartree
oneelecener: -5951.14547627 hartree
twoeener: 2474.57478277 hartree
kineticenergy: 1555.92563279 hartree
xcener: -114.804603413959 hartree
chargesum: -0.0000000
charge: -0.395532 0.732654 -0.289498 -0.314727 -0.303100 -0.133608 -0.399605 -0.420768 -0.005946 -0.005435 0.399642 -0.264028 -0.260833 0.148713 0.372157 -0.265210 -0.253332 -0.095568 -0.137166 0.074699 0.084353 0.068303 0.075531 0.083499 0.094621 0.075713 0.086321 0.082180 0.091978 0.121942 0.094431 0.099175 0.099528 0.103773 0.115854 0.101188 0.108726 0.116061 0.113313
qa: -0.3955 0.7327 -0.2895 -0.3147 -0.3031 -0.1336 -0.3996 -0.4208 -0.0059 -0.0054 0.3996 -0.2640 -0.2608 0.1487 0.3722 -0.2652 -0.2533 -0.0956 -0.1372 0.0747 0.0844 0.0683 0.0755 0.0835 0.0946 0.0757 0.0863 0.0822 0.0920 0.1219 0.0944 0.0992 0.0995 0.1038 0.1159 0.1012 0.1087 0.1161 0.1133
va: 2.0332 5.5051 2.2255 2.1029 2.1404 3.1827 2.9967 2.9461 3.8472 3.8656 4.0746 3.9095 3.9084 3.9286 4.0462 3.9271 3.9058 3.8633 3.8851 1.0014 1.0252 1.0194 1.0054 1.0110 1.0128 1.0064 1.0112 1.0093 1.0191 1.0145 1.0014 0.9986 1.0214 0.9864 0.9929 1.0130 0.9867 0.9917 1.0039
dispcorr: -0.019602095 hartree
energy: -1560.930541902156
dipole: -20.18337 19.96404 -0.21932 -9.70805 9.57441 -0.13364 2.01437 -1.21515 0.79922
magnitude: 0.83948 au
magnitude: 2.13378 debye
