program: Orca
programVersion: 5.0.2
elementType: S P O O O N N N C C C C C C C C C C C H H H H H H H H H H H H H H H H H H H H
charge: 0
multiplicity: 1
keywords: wb97x-d3
keywords: def2-TZVPP
keywords: def2/J RIJCOSX
keywords: DEFGRID2
keywords: scfconv7
keywords: smallprint printgap noloewdin
keywords: NOSOSCF
formula: C11H20N3O3PS
InChI: InChI=1/C11H20N3O3PS/c1-6-14(7-2)11-12-9(3)8-10(13-11)17-18(19,15-4)16-5/h8H,6-7H2,1-5H3
39 atoms
S  2.023133 -1.658819 1.425594
P  2.388496 -0.042253 0.477488
O  1.338352 1.195277 0.662743
O  3.717511 0.735285 0.897854
O  2.584152 -0.105615 -1.097385
N  -2.216962 -0.8924 -1.358255
N  -2.576944 1.113641 -0.304312
N  -0.416854 0.130856 -0.34641
C  -3.632944 -0.941026 -1.679233
C  -1.370411 -2.018076 -1.705514
C  -1.723534 0.143644 -0.646162
C  -4.517665 -1.44263 -0.546873
C  -1.149157 -3.01108 -0.573903
C  -2.094947 2.141364 0.375434
C  0.029134 1.154504 0.336684
C  -0.758621 2.219264 0.744495
C  -3.054958 3.229251 0.744765
C  4.026874 0.948638 2.268787
C  2.607673 -1.340722 -1.800107
H  -3.960334 0.053106 -1.980755
H  -3.741973 -1.588785 -2.550733
H  -1.83845 -2.518698 -2.554652
H  -0.410282 -1.641104 -2.057698
H  -5.560754 -1.458268 -0.865765
H  -4.249649 -2.453348 -0.239616
H  -4.442217 -0.78774 0.319479
H  -0.529278 -3.840263 -0.918361
H  -0.635825 -2.543148 0.264511
H  -2.09145 -3.428754 -0.219025
H  -0.356952 3.047325 1.308996
H  -3.126324 3.332029 1.828382
H  -2.722436 4.190705 0.351759
H  -4.044498 3.013641 0.350226
H  5.057038 1.293454 2.309208
H  3.93189 0.027111 2.84537
H  3.378973 1.711112 2.704105
H  3.552286 -1.862107 -1.644626
H  2.501007 -1.096834 -2.854141
H  1.79146 -1.99272 -1.491302
totalener: -1560.91160272 hartree
nucrepener: 1911.73187543 hartree
electener: -3472.64347815 hartree
oneelecener: -5943.34822965 hartree
twoeener: 2470.70475151 hartree
kineticenergy: 1555.91509600 hartree
xcener: -114.800715969185 hartree
chargesum: 0.0000000
charge: -0.393731 0.736307 -0.302317 -0.312549 -0.305911 -0.135120 -0.399909 -0.399117 -0.004770 -0.037601 0.418257 -0.260850 -0.260071 0.144496 0.354964 -0.259670 -0.254772 -0.127176 -0.113577 0.084039 0.073477 0.077741 0.084657 0.082458 0.072988 0.095329 0.082737 0.099163 0.081277 0.115280 0.096693 0.096196 0.100518 0.114563 0.106986 0.112274 0.126271 0.118668 0.091803
qa: -0.3937 0.7363 -0.3023 -0.3125 -0.3059 -0.1351 -0.3999 -0.3991 -0.0048 -0.0376 0.4183 -0.2609 -0.2601 0.1445 0.3550 -0.2597 -0.2548 -0.1272 -0.1136 0.0840 0.0735 0.0777 0.0847 0.0825 0.0730 0.0953 0.0827 0.0992 0.0813 0.1153 0.0967 0.0962 0.1005 0.1146 0.1070 0.1123 0.1263 0.1187 0.0918
va: 2.0310 5.4904 2.1914 2.1379 2.1060 3.1916 2.9922 2.9759 3.8465 3.8834 4.0557 3.9125 3.8892 3.9385 4.0707 3.9191 3.9033 3.8805 3.8673 1.0249 1.0020 1.0056 1.0024 1.0108 1.0072 1.0128 1.0104 1.0233 1.0119 1.0166 0.9994 1.0000 1.0216 0.9904 1.0047 0.9886 0.9940 0.9902 0.9945
dispcorr: -0.019301178 hartree
energy: -1560.930903892956
dipole: -20.32200 20.09744 -0.22456 -6.96445 7.23869 0.27424 -5.53457 5.15387 -0.38070
magnitude: 0.52016 au
magnitude: 1.32214 debye
