program: Orca
programVersion: 5.0.2
elementType: S P O O O N N N C C C C C C C C C C C H H H H H H H H H H H H H H H H H H H H
charge: 0
multiplicity: 1
keywords: wb97x-d3
keywords: def2-TZVPP
keywords: def2/J RIJCOSX
keywords: DEFGRID2
keywords: scfconv7
keywords: smallprint printgap noloewdin
keywords: NOSOSCF
formula: C11H20N3O3PS
InChI: InChI=1/C11H20N3O3PS/c1-6-14(7-2)11-12-9(3)8-10(13-11)17-18(19,15-4)16-5/h8H,6-7H2,1-5H3
39 atoms
S  2.339741 -0.898509 -1.618452
P  2.348266 0.031038 0.049382
O  1.340735 1.300148 0.243207
O  2.066679 -0.788163 1.382269
O  3.713957 0.774094 0.419868
N  -2.40219 -1.223994 -0.454333
N  -2.669376 1.043772 -0.153012
N  -0.528384 0.034543 -0.052381
C  -3.841249 -1.35987 -0.579556
C  -1.557928 -2.404966 -0.498079
C  -1.855808 -0.014719 -0.210337
C  -4.583813 -1.404549 0.748471
C  -1.245016 -2.993015 0.870804
C  -2.109749 2.229834 0.031002
C  -0.001426 1.217662 0.10871
C  -0.735519 2.391539 0.161989
C  -3.023206 3.414711 0.080895
C  2.417124 -2.160459 1.498217
C  4.415009 1.536856 -0.553312
H  -4.223292 -0.534453 -1.179501
H  -4.029595 -2.275363 -1.142615
H  -2.069738 -3.146111 -1.114294
H  -0.627107 -2.156362 -1.008044
H  -4.256303 -2.238749 1.368828
H  -4.433039 -0.481256 1.305484
H  -5.654609 -1.520395 0.57555
H  -0.726011 -2.26409 1.492086
H  -2.146934 -3.311148 1.393632
H  -0.598849 -3.865672 0.763874
H  -0.273524 3.356057 0.309876
H  -2.906667 4.023042 -0.817555
H  -4.060019 3.094362 0.143138
H  -2.796112 4.053626 0.934234
H  1.933739 -2.529667 2.399151
H  3.496728 -2.282442 1.595923
H  2.068616 -2.732899 0.638466
H  4.599574 0.953634 -1.456442
H  5.364081 1.82113 -0.105376
H  3.864421 2.440936 -0.819246
totalener: -1560.91163763 hartree
nucrepener: 1911.35237961 hartree
electener: -3472.26401724 hartree
oneelecener: -5942.66683399 hartree
twoeener: 2470.40281675 hartree
kineticenergy: 1555.92753391 hartree
xcener: -114.801166291517 hartree
chargesum: -0.0000000
charge: -0.392350 0.738362 -0.303921 -0.301174 -0.317097 -0.136697 -0.399663 -0.393933 -0.007056 -0.008225 0.419726 -0.259112 -0.290801 0.148218 0.352766 -0.265707 -0.253995 -0.143914 -0.128348 0.085370 0.073231 0.075134 0.092708 0.071002 0.094103 0.083058 0.092101 0.088609 0.086110 0.115901 0.098583 0.099980 0.092650 0.117552 0.131477 0.109923 0.108904 0.114731 0.111796
qa: -0.3923 0.7384 -0.3039 -0.3012 -0.3171 -0.1367 -0.3997 -0.3939 -0.0071 -0.0082 0.4197 -0.2591 -0.2908 0.1482 0.3528 -0.2657 -0.2540 -0.1439 -0.1283 0.0854 0.0732 0.0751 0.0927 0.0710 0.0941 0.0831 0.0921 0.0886 0.0861 0.1159 0.0986 0.1000 0.0927 0.1176 0.1315 0.1099 0.1089 0.1147 0.1118
va: 2.0368 5.5001 2.2003 2.1057 2.1281 3.1990 2.9950 2.9642 3.8506 3.8481 4.0488 3.9116 3.9010 3.9362 4.0711 3.9243 3.9082 3.8661 3.8806 1.0239 1.0026 1.0070 1.0249 1.0074 1.0131 1.0109 1.0033 1.0093 1.0085 1.0162 0.9987 1.0208 1.0013 0.9866 0.9929 1.0000 1.0048 0.9905 0.9879
dispcorr: -0.019218592 hartree
energy: -1560.930856219313
dipole: -19.66049 19.54105 -0.11944 -8.19217 8.22922 0.03705 5.07595 -4.64202 0.43393
magnitude: 0.45159 au
magnitude: 1.14786 debye
