program: Orca
programVersion: 5.0.2
elementType: S P O O O N N N C C C C C C C C C C C H H H H H H H H H H H H H H H H H H H H
charge: 0
multiplicity: 1
keywords: wb97x-d3
keywords: def2-TZVPP
keywords: def2/J RIJCOSX
keywords: DEFGRID2
keywords: scfconv7
keywords: smallprint printgap noloewdin
keywords: NOSOSCF
formula: C11H20N3O3PS
InChI: InChI=1/C11H20N3O3PS/c1-6-14(7-2)11-12-9(3)8-10(13-11)17-18(19,15-4)16-5/h8H,6-7H2,1-5H3
39 atoms
S  2.289141 -0.655426 -1.973543
P  2.393351 -0.097166 -0.160435
O  1.418194 1.149582 0.30551
O  2.192405 -1.23977 0.922064
O  3.776524 0.551344 0.319778
N  -2.390883 -1.226222 -0.472495
N  -2.600092 1.032897 -0.066503
N  -0.486115 -0.033285 -0.033139
C  -3.834931 -1.329734 -0.567429
C  -1.5671 -2.416902 -0.60445
C  -1.81793 -0.041704 -0.182048
C  -4.542993 -1.414825 0.777511
C  -1.223511 -3.084493 0.71893
C  -2.005383 2.196447 0.160051
C  0.075734 1.125428 0.167694
C  -0.627194 2.317608 0.277929
C  -2.90026 3.390915 0.262835
C  2.032032 -0.965682 2.309559
C  4.406034 1.569455 -0.446286
H  -4.215971 -0.473383 -1.123375
H  -4.055159 -2.217872 -1.161484
H  -2.110388 -3.114442 -1.244037
H  -0.64771 -2.156165 -1.128464
H  -4.218484 -2.28273 1.351573
H  -4.354609 -0.52027 1.368942
H  -5.620614 -1.497584 0.630522
H  -2.115368 -3.412085 1.253392
H  -0.596502 -3.959274 0.544689
H  -0.667014 -2.402714 1.359922
H  -0.137866 3.263476 0.453257
H  -3.733942 3.182942 0.931374
H  -2.37077 4.270631 0.622133
H  -3.324615 3.624554 -0.713927
H  2.170296 -1.91017 2.829911
H  1.02855 -0.592314 2.5171
H  2.769049 -0.251289 2.677556
H  4.485943 1.280715 -1.495298
H  5.40275 1.70626 -0.033938
H  3.859882 2.511605 -0.375002
totalener: -1560.91077646 hartree
nucrepener: 1915.66630134 hartree
electener: -3476.57707780 hartree
oneelecener: -5951.20120286 hartree
twoeener: 2474.62412506 hartree
kineticenergy: 1555.91607979 hartree
xcener: -114.797642418971 hartree
chargesum: 0.0000000
charge: -0.358742 0.733470 -0.314192 -0.297615 -0.325856 -0.136044 -0.412789 -0.386636 -0.006341 -0.003530 0.409104 -0.259329 -0.259577 0.151087 0.339243 -0.261932 -0.238092 -0.141718 -0.123003 0.085239 0.073778 0.073514 0.091843 0.072393 0.092030 0.083812 0.078353 0.090136 0.079366 0.112565 0.097172 0.081812 0.098869 0.123952 0.099632 0.125377 0.107801 0.114207 0.110639
qa: -0.3587 0.7335 -0.3142 -0.2976 -0.3259 -0.1360 -0.4128 -0.3866 -0.0063 -0.0035 0.4091 -0.2593 -0.2596 0.1511 0.3392 -0.2619 -0.2381 -0.1417 -0.1230 0.0852 0.0738 0.0735 0.0918 0.0724 0.0920 0.0838 0.0784 0.0901 0.0794 0.1126 0.0972 0.0818 0.0989 0.1240 0.0996 0.1254 0.1078 0.1142 0.1106
va: 2.0908 5.4794 2.1230 2.1166 2.1107 3.2052 2.9887 2.9226 3.8475 3.8563 4.0718 3.9129 3.9191 3.9413 4.0789 3.9470 3.9524 3.8789 3.8772 1.0243 1.0028 1.0041 1.0243 1.0062 1.0135 1.0112 1.0055 1.0119 1.0033 1.0145 1.0087 1.0081 1.0033 0.9875 0.9869 0.9979 1.0071 0.9902 0.9886
dispcorr: -0.019537650 hartree
energy: -1560.930314107726
dipole: -20.97304 20.66832 -0.30473 -4.02641 4.63641 0.61001 9.36003 -8.27672 1.08331
magnitude: 1.28005 au
magnitude: 3.25363 debye
